TOHSA MetaData -Catalog- Core Model
type: Ontology
imports: core
imports: prov-o#
imports: vocab-dcat-3#
contributor: Achille Zappa,SOKA University, GaLSIC, Hachioji, Tokyo, Japan
rights: Copyright
Contributor: Makx Dekkers
creator: dx
description: DCAT er et RDF-vokabular som har til formål at understøtte interoperabilitet mellem datakataloger udgivet på nettet. Ved at anvende DCAT til at beskrive datasæt i datakataloger, kan udgivere øge findbarhed og gøre det gøre det lettere for applikationer at anvende metadata fra forskellige kataloger. Derudover understøttes decentraliseret udstilling af kataloger og fødererede datasætsøgninger på tværs af websider. Aggregerede DCAT-metadata kan fungere som fortegnelsesfiler der kan understøtte digital bevaring. DCAT er defineret på http://www.w3.org/TR/vocab-dcat/. Enhver forskel mellem det normative dokument og dette schema er en fejl i dette schema. @da
description: DCAT es un vocabulario RDF diseñado para facilitar la interoperabilidad entre catálogos de datos publicados en la Web. Utilizando DCAT para describir datos disponibles en catálogos se aumenta la posibilidad de que sean descubiertos y se permite que las aplicaciones consuman fácilmente los metadatos de varios catálogos. @es
description: DCAT est un vocabulaire développé pour faciliter l'interopérabilité entre les jeux de données publiées sur le Web. En utilisant DCAT pour décrire les jeux de données dans les catalogues de données, les fournisseurs de données facilitent leur découverte et permettent que les applications consomment facilement les métadonnées de plusieurs catalogues. Il permet de plus la publication décentralisée des catalogues et facilite la recherche fédérée des données entre plusieurs sites. Les métadonnées DCAT aggrégées peuvent servir comme un manifeste pour faciliter la préservation digitale des ressources. DCAT est définie à l'adresse http://www.w3.org/TR/vocab-dcat/. Toute différence entre ce document normatif et le présent vocabulaire est une erreur dans le vocabulaire. @fr
description: DCAT is an RDF vocabulary designed to facilitate interoperability between data catalogs published on the Web. By using DCAT to describe datasets in data catalogs, publishers increase discoverability and enable applications easily to consume metadata from multiple catalogs. It further enables decentralized publishing of catalogs and facilitates federated dataset search across sites. Aggregated DCAT metadata can serve as a manifest file to facilitate digital preservation. DCAT is defined at http://www.w3.org/TR/vocab-dcat/. Any variance between that normative document and this schema is an error in this schema.
description: DCAT je RDF slovník navržený pro zprostředkování interoperability mezi datovými katalogy publikovanými na Webu. Poskytovatelé dat používáním slovníku DCAT pro popis datových sad v datových katalozích zvyšují jejich dohledatelnost a umožňují aplikacím konzumovat metadata z více katalogů. Dále je umožňena decentralizovaná publikace katalogů a federované dotazování na datové sady napříč katalogy. Agregovaná DCAT metadata mohou také sloužit jako průvodka umožňující digitální uchování informace. DCAT je definován na http://www.w3.org/TR/vocab-dcat/. Jakýkoliv nesoulad mezi odkazovaným dokumentem a tímto schématem je chybou v tomto schématu. @cs
description: DCAT è un vocabolario RDF progettato per facilitare l'interoperabilità tra i cataloghi di dati pubblicati nel Web. Utilizzando DCAT per descrivere i dataset nei cataloghi di dati, i fornitori migliorano la capacità di individuazione dei dati e abilitano le applicazioni al consumo di dati provenienti da cataloghi differenti. DCAT permette di decentralizzare la pubblicazione di cataloghi e facilita la ricerca federata dei dataset. L'aggregazione dei metadati federati può fungere da file manifesto per facilitare la conservazione digitale. DCAT è definito all'indirizzo http://www.w3.org/TR/vocab-dcat/. Qualsiasi scostamento tra tale definizione normativa e questo schema è da considerarsi un errore di questo schema. @it
description: DCATは、ウェブ上で公開されたデータ・カタログ間の相互運用性の促進を目的とするRDFの語彙です。このドキュメントでは、その利用のために、スキーマを定義し、例を提供します。データ・カタログ内のデータセットを記述するためにDCATを用いると、公開者が、発見可能性を増加させ、アプリケーションが複数のカタログのメタデータを容易に利用できるようになります。さらに、カタログの分散公開を可能にし、複数のサイトにまたがるデータセットの統合検索を促進します。集約されたDCATメタデータは、ディジタル保存を促進するためのマニフェスト・ファイルとして使用できます。 @ja
description: Το DCAT είναι ένα RDF λεξιλόγιο που σχεδιάσθηκε για να κάνει εφικτή τη διαλειτουργικότητα μεταξύ καταλόγων δεδομένων στον Παγκόσμιο Ιστό. Χρησιμοποιώντας το DCAT για την περιγραφή συνόλων δεδομένων, οι εκδότες αυτών αυξάνουν την ανακαλυψιμότητα και επιτρέπουν στις εφαρμογές την εύκολη κατανάλωση μεταδεδομένων από πολλαπλούς καταλόγους. Επιπλέον, δίνει τη δυνατότητα για αποκεντρωμένη έκδοση και διάθεση καταλόγων και επιτρέπει δυνατότητες ενοποιημένης αναζήτησης μεταξύ διαφορετικών πηγών. Συγκεντρωτικά μεταδεδομένα που έχουν περιγραφεί με το DCAT μπορούν να χρησιμοποιηθούν σαν ένα δηλωτικό αρχείο (manifest file) ώστε να διευκολύνουν την ψηφιακή συντήρηση. @el
description: هي أنطولوجية تسهل تبادل البيانات بين مختلف الفهارس على الوب. استخدام هذه الأنطولوجية يساعد على اكتشاف قوائم البيانات المنشورة على الوب و يمكن التطبيقات المختلفة من الاستفادة أتوماتيكيا من البيانات المتاحة من مختلف الفهارس. @ar
License: https://creativecommons.org/licenses/by/4.0/
publisher: World Wide Web Consortium (W3C)
title: Datakatalogvokabular @da
title: El vocabulario de catálogo de datos @es
title: Il vocabolario del catalogo dei dati @it
title: Le vocabulaire des catalogues de données @fr
title: Slovník pro datové katalogy @cs
title: The data catalog vocabulary
title: Το λεξιλόγιο των καταλόγων δεδομένων @el
title: أنطولوجية فهارس قوائم البيانات @ar
title: データ・カタログ語彙（DCAT） @ja
editor: Riccardo Albertoni
editor: David Browning
editor: Simon J D Cox
  type: Person
  member of: Commonwealth Scientific and Industrial Research Organisation
  work info homepage: http://people.csiro.au/Simon-Cox
editor: Alejandra Gonzalez-Beltran
  type: Person
  member of: Science and Technology Facilities Council, UK
editor: Andrea Perego
editor: Peter Winstanley
translator: Shuji Kamitsuna
translator: Jakub Klímek
translator: Fadi Maali
  type: Person
  member of: DERI, NUI Galway
translator: Anna Odgaard Ingram
translator: Vassilios Peristeras
  type: Person
  member of: European Commission, DG DIGIT
preferred namespace prefix: core
preferred namespace prefix: dcat
preferred namespace uri: http://www.w3.org/ns/dcat#
label: Le vocabulaire des jeux de données @fr
backward compatible with: dcat2
backward compatible with: dcat2014
prior version: dcat2
version info: 0.1.2
version info: 3
editorial note: English language definitions updated in this revision in line with ED. Multilingual text unevenly updated.
version notes: Dette er en opdateret kopi af DCAT 3 som er tilgænglig på https://www.w3.org/ns/dcat.ttl @da
version notes: Esta es una copia del vocabulario DCAT 3 disponible en https://www.w3.org/ns/dcat.ttl @es
version notes: Questa è una copia aggiornata del vocabolario DCAT 3 disponibile in https://www.w3.org/ns/dcat.ttl @it
version notes: This is an updated copy of the DCAT 3 vocabulary, taken from https://www.w3.org/ns/dcat.ttl
version notes: Toto je aktualizovaná kopie slovníku DCAT 3, převzatá z https://www.w3.org/ns/dcat.ttl @cs
type: NamedIndividual
issued: 2025
Date Modified: 2025

Abstract
type: AnnotationProperty
sub property of: description
sub property of: Description
type: NamedIndividual
issued: 2000-07-11
comment: A summary of the resource.

Access Rights
type: AnnotationProperty
sub property of: rights
sub property of: Rights
type: NamedIndividual
issued: 2003-02-15
range includes: Rights Statement
description: Access Rights may include information regarding access or restrictions based on privacy, security, or other policies.
comment: Information about who access the resource or an indication of its security status.

Accrual Method
type: AnnotationProperty
domain: Collection
type: NamedIndividual
issued: 2005-06-13
range includes: Method of Accrual
description: Recommended practice is to use a value from the Collection Description Accrual Method Vocabulary [[DCMI-ACCRUALMETHOD](https://dublincore.org/groups/collections/accrual-method/)].
comment: The method by which items are added to a collection.

Accrual Periodicity
type: AnnotationProperty
domain: Collection
type: NamedIndividual
issued: 2005-06-13
range includes: Frequency
description: Recommended practice is to use a value from the Collection Description Frequency Vocabulary [[DCMI-COLLFREQ](https://dublincore.org/groups/collections/frequency/)].
comment: The frequency with which items are added to a collection.

Accrual Policy
type: AnnotationProperty
domain: Collection
type: NamedIndividual
issued: 2005-06-13
range includes: Policy
description: Recommended practice is to use a value from the Collection Description Accrual Policy Vocabulary [[DCMI-ACCRUALPOLICY](https://dublincore.org/groups/collections/accrual-policy/)].
comment: The policy governing the addition of items to a collection.

Alternative Title
type: AnnotationProperty
sub property of: title
type: DatatypeProperty
sub property of: Title
range: Literal
type: NamedIndividual
issued: 2000-07-11
description: The distinction between titles and alternative titles is application-specific.
comment: An alternative name for the resource.

Audience
type: AnnotationProperty
type: NamedIndividual
issued: 2001-05-21
range includes: Agent Class
description: Recommended practice is to use this property with non-literal values from a vocabulary of audience types.
comment: A class of agents for whom the resource is intended or useful.

Date Available
type: AnnotationProperty
sub property of: date
type: DatatypeProperty
sub property of: Date
range: Literal
type: NamedIndividual
issued: 2000-07-11
description: Recommended practice is to describe the date, date/time, or period of time as recommended for the property Date, of which this is a subproperty.
comment: Date that the resource became or will become available.

Bibliographic Citation
type: AnnotationProperty
sub property of: identifier
type: DatatypeProperty
sub property of: Identifier
range: Literal
type: NamedIndividual
issued: 2003-02-15
description: Recommended practice is to include sufficient bibliographic detail to identify the resource as unambiguously as possible.
comment: A bibliographic reference for the resource.

Conforms To
type: AnnotationProperty
sub property of: relation
sub property of: Relation
type: NamedIndividual
issued: 2001-05-21
range includes: Standard
comment: An established standard to which the described resource conforms.

Contributor
sub property of: contributor
type: NamedIndividual
issued: 2008-01-14
range includes: Agent
description: The guidelines for using names of persons or organizations as creators apply to contributors.
comment: An entity responsible for making contributions to the resource.

Coverage
type: AnnotationProperty
sub property of: coverage
type: NamedIndividual
issued: 2008-01-14
range includes: Jurisdiction
range includes: Location
range includes: DCMI Period
description: Spatial topic and spatial applicability may be a named place or a location specified by its geographic coordinates. Temporal topic may be a named period, date, or date range. A jurisdiction may be a named administrative entity or a geographic place to which the resource applies. Recommended practice is to use a controlled vocabulary such as the Getty Thesaurus of Geographic Names [[TGN](https://www.getty.edu/research/tools/vocabulary/tgn/index.html)]. Where appropriate, named places or time periods may be used in preference to numeric identifiers such as sets of coordinates or date ranges. Because coverage is so broadly defined, it is preferable to use the more specific subproperties Temporal Coverage and Spatial Coverage.
comment: The spatial or temporal topic of the resource, spatial applicability of the resource, or jurisdiction under which the resource is relevant.

Date Created
type: AnnotationProperty
sub property of: date
type: DatatypeProperty
sub property of: Date
range: Literal
type: NamedIndividual
issued: 2000-07-11
description: Recommended practice is to describe the date, date/time, or period of time as recommended for the property Date, of which this is a subproperty.
comment: Date of creation of the resource.

Creator
sub property of: creator
sub property of: Contributor
type: NamedIndividual
issued: 2008-01-14
range includes: Agent
description: Recommended practice is to identify the creator with a URI. If this is not possible or feasible, a literal value that identifies the creator may be provided.
comment: An entity responsible for making the resource.

Date
type: AnnotationProperty
sub property of: date
type: DatatypeProperty
range: Literal
type: NamedIndividual
issued: 2008-01-14
description: Date may be used to express temporal information at any level of granularity. Recommended practice is to express the date, date/time, or period of time according to ISO 8601-1 [[ISO 8601-1](https://www.iso.org/iso-8601-date-and-time-format.html)] or a published profile of the ISO standard, such as the W3C Note on Date and Time Formats [[W3CDTF](https://www.w3.org/TR/NOTE-datetime)] or the Extended Date/Time Format Specification [[EDTF](http://www.loc.gov/standards/datetime/)]. If the full date is unknown, month and year (YYYY-MM) or just year (YYYY) may be used. Date ranges may be specified using ISO 8601 period of time specification in which start and end dates are separated by a '/' (slash) character. Either the start or end date may be missing.
comment: A point or period of time associated with an event in the lifecycle of the resource.

Date Accepted
type: AnnotationProperty
sub property of: date
type: DatatypeProperty
sub property of: Date
range: Literal
type: NamedIndividual
issued: 2002-07-13
description: Recommended practice is to describe the date, date/time, or period of time as recommended for the property Date, of which this is a subproperty. Examples of resources to which a date of acceptance may be relevant are a thesis (accepted by a university department) or an article (accepted by a journal).
comment: Date of acceptance of the resource.

Date Copyrighted
type: AnnotationProperty
sub property of: date
type: DatatypeProperty
sub property of: Date
range: Literal
type: NamedIndividual
issued: 2002-07-13
description: Typically a year. Recommended practice is to describe the date, date/time, or period of time as recommended for the property Date, of which this is a subproperty.
comment: Date of copyright of the resource.

Date Submitted
type: AnnotationProperty
sub property of: date
type: DatatypeProperty
sub property of: Date
range: Literal
type: NamedIndividual
issued: 2002-07-13
description: Recommended practice is to describe the date, date/time, or period of time as recommended for the property Date, of which this is a subproperty. Examples of resources to which a 'Date Submitted' may be relevant include a thesis (submitted to a university department) or an article (submitted to a journal).
comment: Date of submission of the resource.

Description
sub property of: description
type: NamedIndividual
issued: 2008-01-14
description: Description may include but is not limited to: an abstract, a table of contents, a graphical representation, or a free-text account of the resource.
comment: An account of the resource.

Audience Education Level
type: AnnotationProperty
sub property of: Audience
type: NamedIndividual
issued: 2002-07-13
range includes: Agent Class
comment: A class of agents, defined in terms of progression through an educational or training context, for which the described resource is intended.

Extent
type: AnnotationProperty
sub property of: format
sub property of: Format
type: NamedIndividual
issued: 2000-07-11
range includes: Size or Duration
description: Recommended practice is to specify the file size in megabytes and duration in ISO 8601 format.
comment: The size or duration of the resource.

Format
type: AnnotationProperty
sub property of: format
type: NamedIndividual
issued: 2008-01-14
range includes: Extent
range includes: Media Type
description: Recommended practice is to use a controlled vocabulary where available. For example, for file formats one could use the list of Internet Media Types [[MIME](https://www.iana.org/assignments/media-types/media-types.xhtml)]. Examples of dimensions include size and duration.
comment: The file format, physical medium, or dimensions of the resource.

Has Format
type: AnnotationProperty
sub property of: relation
sub property of: Relation
type: NamedIndividual
issued: 2000-07-11
description: This property is intended to be used with non-literal values. This property is an inverse property of Is Format Of.
comment: A related resource that is substantially the same as the pre-existing described resource, but in another format.

Has Part
type: AnnotationProperty
sub property of: relation
sub property of: Relation
type: NamedIndividual
issued: 2000-07-11
description: This property is intended to be used with non-literal values. This property is an inverse property of Is Part Of.
comment: A related resource that is included either physically or logically in the described resource.

Has Version
type: AnnotationProperty
sub property of: relation
sub property of: Relation
type: NamedIndividual
issued: 2000-07-11
description: Changes in version imply substantive changes in content rather than differences in format. This property is intended to be used with non-literal values. This property is an inverse property of Is Version Of.
comment: A related resource that is a version, edition, or adaptation of the described resource.

Identifier
type: AnnotationProperty
sub property of: identifier
type: DatatypeProperty
range: Literal
type: NamedIndividual
issued: 2008-01-14
description: Recommended practice is to identify the resource by means of a string conforming to an identification system. Examples include International Standard Book Number (ISBN), Digital Object Identifier (DOI), and Uniform Resource Name (URN). Persistent identifiers should be provided as HTTP URIs.
comment: An unambiguous reference to the resource within a given context.

Is Format Of
type: AnnotationProperty
sub property of: relation
sub property of: Relation
type: NamedIndividual
issued: 2000-07-11
description: This property is intended to be used with non-literal values. This property is an inverse property of Has Format.
comment: A pre-existing related resource that is substantially the same as the described resource, but in another format.

Is Part Of
type: AnnotationProperty
sub property of: relation
sub property of: Relation
type: NamedIndividual
issued: 2000-07-11
description: This property is intended to be used with non-literal values. This property is an inverse property of Has Part.
comment: A related resource in which the described resource is physically or logically included.

Is Referenced By
type: AnnotationProperty
sub property of: relation
sub property of: Relation
type: NamedIndividual
issued: 2000-07-11
description: This property is intended to be used with non-literal values. This property is an inverse property of References.
comment: A related resource that references, cites, or otherwise points to the described resource.

Is Replaced By
type: AnnotationProperty
sub property of: relation
sub property of: Relation
type: NamedIndividual
issued: 2000-07-11
description: This property is intended to be used with non-literal values. This property is an inverse property of Replaces.
comment: A related resource that supplants, displaces, or supersedes the described resource.

Is Required By
type: AnnotationProperty
sub property of: relation
sub property of: Relation
type: NamedIndividual
issued: 2000-07-11
description: This property is intended to be used with non-literal values. This property is an inverse property of Requires.
comment: A related resource that requires the described resource to support its function, delivery, or coherence.

Is Version Of
type: AnnotationProperty
sub property of: relation
sub property of: Relation
type: NamedIndividual
issued: 2000-07-11
description: Changes in version imply substantive changes in content rather than differences in format. This property is intended to be used with non-literal values. This property is an inverse property of Has Version.
comment: A related resource of which the described resource is a version, edition, or adaptation.

Date Issued
type: AnnotationProperty
sub property of: date
type: DatatypeProperty
sub property of: Date
range: Literal
type: NamedIndividual
issued: 2000-07-11
description: Recommended practice is to describe the date, date/time, or period of time as recommended for the property Date, of which this is a subproperty.
comment: Date of formal issuance of the resource.

Language
type: AnnotationProperty
sub property of: language
type: NamedIndividual
issued: 2008-01-14
range includes: Linguistic System
description: Recommended practice is to use either a non-literal value representing a language from a controlled vocabulary such as ISO 639-2 or ISO 639-3, or a literal value consisting of an IETF Best Current Practice 47 [[IETF-BCP47](https://tools.ietf.org/html/bcp47)] language tag.
comment: A language of the resource.

License
type: AnnotationProperty
sub property of: rights
sub property of: Rights
type: NamedIndividual
issued: 2004-06-14
range includes: License Document
description: Recommended practice is to identify the license document with a URI. If this is not possible or feasible, a literal value that identifies the license may be provided.
comment: A legal document giving official permission to do something with the resource.

Mediator
type: AnnotationProperty
sub property of: Audience
type: NamedIndividual
issued: 2001-05-21
range includes: Agent Class
description: In an educational context, a mediator might be a parent, teacher, teaching assistant, or care-giver.
comment: An entity that mediates access to the resource.

Medium
type: AnnotationProperty
sub property of: format
sub property of: Format
type: NamedIndividual
issued: 2000-07-11
domain includes: Physical Resource
range includes: Physical Medium
comment: The material or physical carrier of the resource.

Date Modified
type: AnnotationProperty
sub property of: date
type: DatatypeProperty
sub property of: Date
range: Literal
type: NamedIndividual
issued: 2000-07-11
description: Recommended practice is to describe the date, date/time, or period of time as recommended for the property Date, of which this is a subproperty.
comment: Date on which the resource was changed.

Publisher
type: AnnotationProperty
sub property of: publisher
type: NamedIndividual
issued: 2008-01-14
range includes: Agent
comment: An entity responsible for making the resource available.

References
type: AnnotationProperty
sub property of: relation
sub property of: Relation
type: NamedIndividual
issued: 2000-07-11
description: This property is intended to be used with non-literal values. This property is an inverse property of Is Referenced By.
comment: A related resource that is referenced, cited, or otherwise pointed to by the described resource.

Relation
type: AnnotationProperty
sub property of: relation
type: NamedIndividual
issued: 2008-01-14
description: Recommended practice is to identify the related resource by means of a URI. If this is not possible or feasible, a string conforming to a formal identification system may be provided.
comment: A related resource.

Replaces
type: AnnotationProperty
sub property of: relation
sub property of: Relation
type: NamedIndividual
issued: 2000-07-11
description: This property is intended to be used with non-literal values. This property is an inverse property of Is Replaced By.
comment: A related resource that is supplanted, displaced, or superseded by the described resource.

Requires
type: AnnotationProperty
sub property of: relation
sub property of: Relation
type: NamedIndividual
issued: 2000-07-11
description: This property is intended to be used with non-literal values. This property is an inverse property of Is Required By.
comment: A related resource that is required by the described resource to support its function, delivery, or coherence.

Rights
type: AnnotationProperty
sub property of: rights
type: NamedIndividual
issued: 2008-01-14
range includes: Rights Statement
description: Typically, rights information includes a statement about various property rights associated with the resource, including intellectual property rights. Recommended practice is to refer to a rights statement with a URI. If this is not possible or feasible, a literal value (name, label, or short text) may be provided.
comment: Information about rights held in and over the resource.

Source
type: AnnotationProperty
sub property of: source
sub property of: Relation
type: NamedIndividual
issued: 2008-01-14
description: This property is intended to be used with non-literal values. The described resource may be derived from the related resource in whole or in part. Best practice is to identify the related resource by means of a URI or a string conforming to a formal identification system.
comment: A related resource from which the described resource is derived.

Spatial Coverage
type: AnnotationProperty
sub property of: coverage
sub property of: Coverage
type: NamedIndividual
issued: 2000-07-11
range includes: Location
comment: Spatial characteristics of the resource.

Subject
type: AnnotationProperty
sub property of: subject
type: NamedIndividual
issued: 2008-01-14
description: Recommended practice is to refer to the subject with a URI. If this is not possible or feasible, a literal value that identifies the subject may be provided. Both should preferably refer to a subject in a controlled vocabulary.
comment: A topic of the resource.

Table Of Contents
type: AnnotationProperty
sub property of: description
sub property of: Description
type: NamedIndividual
issued: 2000-07-11
comment: A list of subunits of the resource.

Temporal Coverage
type: AnnotationProperty
sub property of: coverage
sub property of: Coverage
type: NamedIndividual
issued: 2000-07-11
range includes: Period of Time
comment: Temporal characteristics of the resource.

Title
sub property of: title
type: DatatypeProperty
range: Literal
type: NamedIndividual
issued: 2008-01-14
comment: A name given to the resource.

Type
type: AnnotationProperty
sub property of: type
type: NamedIndividual
issued: 2008-01-14
description: Recommended practice is to use a controlled vocabulary such as the DCMI Type Vocabulary [[DCMI-TYPE](http://dublincore.org/documents/dcmi-type-vocabulary/)]. To describe the file format, physical medium, or dimensions of the resource, use the property Format.
comment: The nature or genre of the resource.

Date Valid
type: AnnotationProperty
sub property of: date
type: DatatypeProperty
sub property of: Date
range: Literal
type: NamedIndividual
issued: 2000-07-11
description: Recommended practice is to describe the date, date/time, or period of time as recommended for the property Date, of which this is a subproperty.
comment: Date (often a range) of validity of a resource.

category
type: AnnotationProperty
comment: A category for the Data Asset.
domain: Dataset

contactPoint
type: AnnotationProperty
comment: contactPoint
domain: Organization

Download Type
type: AnnotationProperty
comment: Download Type (if means Frequency as 'Stream' or 'Bulk' dataset download)
domain: Distribuce

encAlg
type: AnnotationProperty
comment: Encryption algorithm used to encrypt blocks. Either AES-128-GCM ('A128GCM') or AES-256-GCM ('A256GCM)
domain: DataExchangeSpec

experimentType
type: AnnotationProperty
comment: The experiment types which represent attributes of observations , measurements , protocol metadata prov in the dataset.
domain: Experiment Information

hashAlg
type: AnnotationProperty
comment: Hash algorithm used to compute digest/commitments. It's SHA2 with different output lengths: either 'SHA-256', 'SHA-384' or 'SHA-512'.
domain: DataExchangeSpec

ledgerContractAddress
type: AnnotationProperty
comment: The ledger smart contract address (hexadecimal) on the DLT.
domain: DataExchangeSpec

ledgerSignerAddress
type: AnnotationProperty
comment: The orig (data provider) address in the DLT (hexadecimal).
domain: DataExchangeSpec

pooToPopDelay
type: AnnotationProperty
comment: Maximum acceptable delay between the issuance of the proof of origin (PoP) by the orig and the reception of the proof of publication (PoR) by the dest
domain: DataExchangeSpec

pooToPorDelay
type: AnnotationProperty
comment: Maximum acceptable delay between the issuance of the proof of origin (PoO) by the orig and the reception of the proof of reception (PoR) by the orig
domain: DataExchangeSpec

pooToSecretDelay
type: AnnotationProperty
comment: If the dest (data consumer) does not receive the PoP, it could still get the decryption secret from the DLT. This defines the maximum acceptable delay between the issuance of the proof of origing (PoP) by the orig and the publication (block time) of the secret on the blockchain.
domain: DataExchangeSpec

signingAlg
type: AnnotationProperty
comment: Signing algorithm used to sign the proofs. It'e ECDSA secp256r1 with key lengths: either 'ES256', 'ES384', or 'ES512'
domain: DataExchangeSpec

alternative label
type: AnnotationProperty
comment: The range of skos:altLabel is the class of RDF plain literals.
comment: skos:prefLabel, skos:altLabel and skos:hiddenLabel are pairwise disjoint properties.
definition: An alternative lexical label for a resource.
example: Acronyms, abbreviations, spelling variants, and irregular plural/singular forms may be included among the alternative labels for a concept. Mis-spelled terms are normally included as hidden labels (see skos:hiddenLabel).
sub property of: label

change note
type: AnnotationProperty
definition: A note about a modification to a concept.
sub property of: note

definition
type: AnnotationProperty
definition: A statement or formal explanation of the meaning of a concept.
sub property of: note

editorial note
type: AnnotationProperty
sub property of: note
definition: A note for an editor, translator or maintainer of the vocabulary.

example
type: AnnotationProperty
definition: An example of the use of a concept.
sub property of: note

hidden label
type: AnnotationProperty
comment: The range of skos:hiddenLabel is the class of RDF plain literals.
comment: skos:prefLabel, skos:altLabel and skos:hiddenLabel are pairwise disjoint properties.
definition: A lexical label for a resource that should be hidden when generating visual displays of the resource, but should still be accessible to free text search operations.
sub property of: label

history note
type: AnnotationProperty
definition: A note about the past state/use/meaning of a concept.
sub property of: note

note
type: AnnotationProperty
definition: A general note, for any purpose.
scope note: This property may be used directly, or as a super-property for more specific note types.

preferred label
type: AnnotationProperty
comment: A resource has no more than one value of skos:prefLabel per language tag, and no more than one value of skos:prefLabel without language tag.
comment: The range of skos:prefLabel is the class of RDF plain literals.
comment: skos:prefLabel, skos:altLabel and skos:hiddenLabel are pairwise disjoint properties.
definition: The preferred lexical label for a resource, in a given language.
sub property of: label

scope note
type: AnnotationProperty
definition: A note that helps to clarify the meaning and/or the use of a concept.
sub property of: note

category
type: AnnotationProperty
comment: Classify prov-o terms into three categories, including 'starting-point', 'qualifed', and 'extended'. This classification is used by the prov-o html document to gently introduce prov-o terms to its users.

component
type: AnnotationProperty
comment: Classify prov-o terms into six components according to prov-dm, including 'agents-responsibility', 'alternate', 'annotations', 'collections', 'derivations', and 'entities-activities'. This classification is used so that readers of prov-o specification can find its correspondence with the prov-dm specification.

constraints
type: AnnotationProperty
comment: A reference to the principal section of the PROV-CONSTRAINTS document that describes this concept.
sub property of: seeAlso

definition
type: AnnotationProperty
comment: A definition quoted from PROV-DM or PROV-CONSTRAINTS that describes the concept expressed with this OWL term.

dm
type: AnnotationProperty
comment: A reference to the principal section of the PROV-DM document that describes this concept.
sub property of: seeAlso

editorialNote
type: AnnotationProperty
comment: A note by the OWL development team about how this term expresses the PROV-DM concept, or how it should be used in context of semantic web or linked data.

editorsDefinition
type: AnnotationProperty
comment: When the prov-o term does not have a definition drawn from prov-dm, and the prov-o editor provides one.
sub property of: definition

inverse
type: AnnotationProperty
comment: PROV-O does not define all property inverses. The directionalities defined in PROV-O should be given preference over those not defined. However, if users wish to name the inverse of a PROV-O property, the local name given by prov:inverse should be used.

http://www.w3.org/ns/prov#n
type: AnnotationProperty
comment: A reference to the principal section of the PROV-DM document that describes this concept.
sub property of: seeAlso

order
type: AnnotationProperty
comment: The position that this OWL term should be listed within documentation. The scope of the documentation (e.g., among all terms, among terms within a prov:category, among properties applying to a particular class, etc.) is unspecified.

qualifiedForm
type: AnnotationProperty
comment: This annotation property links a subproperty of prov:wasInfluencedBy with the subclass of prov:Influence and the qualifying property that are used to qualify it. Example annotation: prov:wasGeneratedBy prov:qualifiedForm prov:qualifiedGeneration, prov:Generation . Then this unqualified assertion: :entity1 prov:wasGeneratedBy :activity1 . can be qualified by adding: :entity1 prov:qualifiedGeneration :entity1Gen . :entity1Gen a prov:Generation, prov:Influence; prov:activity :activity1; :customValue 1337 . Note how the value of the unqualified influence (prov:wasGeneratedBy :activity1) is mirrored as the value of the prov:activity (or prov:entity, or prov:agent) property on the influence class.
sub property of: seeAlso

specializationOf
type: AnnotationProperty
range: Entity
type: ObjectProperty
sub property of: alternateOf
domain: Entity
category: expanded
component: alternate
constraints: http://www.w3.org/TR/2013/REC-prov-constraints-20130430/#prov-dm-constraints-fig
definition: An entity that is a specialization of another shares all aspects of the latter, and additionally presents more specific aspects of the same thing as the latter. In particular, the lifetime of the entity being specialized contains that of any specialization. Examples of aspects include a time period, an abstraction, and a context associated with the entity.
dm: http://www.w3.org/TR/2013/REC-prov-dm-20130430/#term-specialization
inverse: generalizationOf
n: http://www.w3.org/TR/2013/REC-prov-n-20130430/#expression-specialization

unqualifiedForm
type: AnnotationProperty
comment: Classes and properties used to qualify relationships are annotated with prov:unqualifiedForm to indicate the property used to assert an unqualified provenance relation.
sub property of: seeAlso

wasRevisionOf
type: AnnotationProperty
range: Entity
type: ObjectProperty
sub property of: wasDerivedFrom
domain: Entity
property chain axiom: qualifiedRevision
property chain axiom: entity
comment: A revision is a derivation that revises an entity into a revised version.
category: expanded
component: derivations
inverse: hadRevision
qualified form: Revision
qualified form: qualifiedRevision

DCMI Box
type: Datatype
type: NamedIndividual
issued: 2000-07-11
comment: The set of regions in space defined by their geographic coordinates according to the DCMI Box Encoding Scheme.

ISO 3166
type: Datatype
type: NamedIndividual
issued: 2000-07-11
comment: The set of codes listed in ISO 3166-1 for the representation of names of countries.

ISO 639-2
type: Datatype
type: NamedIndividual
issued: 2000-07-11
comment: The three-letter alphabetic codes listed in ISO639-2 for the representation of names of languages.

ISO 639-3
type: Datatype
type: NamedIndividual
issued: 2008-01-14
comment: The set of three-letter codes listed in ISO 639-3 for the representation of names of languages.

DCMI Period
type: Datatype
type: NamedIndividual
issued: 2000-07-11
comment: The set of time intervals defined by their limits according to the DCMI Period Encoding Scheme.

DCMI Point
type: Datatype
type: NamedIndividual
issued: 2000-07-11
comment: The set of points in space defined by their geographic coordinates according to the DCMI Point Encoding Scheme.

RFC 1766
type: Datatype
type: NamedIndividual
issued: 2000-07-11
comment: The set of tags, constructed according to RFC 1766, for the identification of languages.

RFC 3066
type: Datatype
type: NamedIndividual
issued: 2002-07-13
description: RFC 3066 has been obsoleted by RFC 4646.
comment: The set of tags constructed according to RFC 3066 for the identification of languages.

RFC 4646
type: Datatype
type: NamedIndividual
issued: 2008-01-14
description: RFC 4646 obsoletes RFC 3066.
comment: The set of tags constructed according to RFC 4646 for the identification of languages.

RFC 5646
type: Datatype
type: NamedIndividual
issued: 2010-10-11
description: RFC 5646 obsoletes RFC 4646.
comment: The set of tags constructed according to RFC 5646 for the identification of languages.

URI
type: Datatype
type: NamedIndividual
issued: 2000-07-11
comment: The set of identifiers constructed according to the generic syntax for Uniform Resource Identifiers as specified by the Internet Engineering Task Force.

W3C-DTF
type: Datatype
type: NamedIndividual
issued: 2000-07-11
comment: The set of dates and times constructed according to the W3C Date and Time Formats Specification.

Data Source Did
type: ObjectProperty
inverse of: own
domain: Dataset
range: Owner
comment: The Data Source Did

Source Name Id
type: ObjectProperty
inverse of: provide
domain: Dataset
range: Provider
comment: The Data Source name Id

contractParameters
type: ObjectProperty
domain: Dataset
range: ContractParameters
comment: contractParameters

dataExchangeSpec
type: ObjectProperty
domain: Data service
range: DataExchangeSpec
comment: Data Exchange Specifications

DataSourceUnit
type: ObjectProperty
domain: DataSource
range: Organization
comment: Information on Data Source Unit

dataset
type: ObjectProperty
domain: Provider
range: Dataset
comment: Relation between an dataAsset and the provider who registered it.

datasetCreated
type: ObjectProperty
domain: Dataset
range: DateTime
comment: Date of formal issuance (e.g., publication) of the Data Asset.

datasetExpirationTime
type: ObjectProperty
domain: Dataset
range: DateTime
comment: Expiration time.

Dataset Information
type: ObjectProperty
domain: Dataset
range: Dataset Information
comment: More specific dasasets information annotations for types of info to describe specific details of the dataset.

datasetQuery
type: ObjectProperty
domain: Consumer
range: datasetQuery
type: Class
subclass of: Demand
inverse of: isRegisteredBy
comment: Concepts likely to be involved in dataAssets of a certain category.
comment: Consumers discover dataAssets they're interesting through tohsa by providing an (dataAsset) query. The query entails a specification of the type of dataAssets the consumer is interested in

Data Record
type: ObjectProperty
domain: Dataset
range: Dataset Record
comment: The annotations of data records types which represent attributes of observations , measurements , fields,.. in the dataset.

fromExperiment
type: ObjectProperty
domain: DataSource
range: Experiment Information
comment: The experiment types which represent attributes of observations , measurements , protocol metadata prov in the dataset.

fromSample
type: ObjectProperty
domain: Experiment Information
range: Sample
comment: The sample which represent attributes of observations , measurements , protocol metadata prov in the dataset.

hasDataSource
type: ObjectProperty
domain: Dataset Information
range: DataSource
comment: hasDataSource

hasIntendedUse
type: ObjectProperty
domain: ContractParameters
range: IntendedUse
comment: hasIntendedUse

hasLicenseGrant
type: ObjectProperty
domain: ContractParameters
range: LicenseGrant
comment: hasLicenseGrant

hasPricingModel
type: ObjectProperty
domain: Dataset
range: pricingmodelPricingModel
comment: Relation between an dataAsset and the PricingModel.

isRegisteredBy
type: ObjectProperty
domain: datasetQuery
range: Consumer
comment: Relation between an dataAssetQuery and the consumer who registered it.

lastModified
type: ObjectProperty
domain: Dataset
range: DateTime
comment: Most recent date on which the Data Asset was changed, updated or modified.

Data Owner
type: ObjectProperty
inverse of: own
domain: Dataset
range: Owner
comment: Relation between an dataAsset and the owner of the datasets.

Data owner Did
type: ObjectProperty
inverse of: own
domain: Dataset
range: Owner
comment: The Data owner Did

Data Provider
type: ObjectProperty
inverse of: provide
domain: Dataset
range: Provider
comment: Relation between an dataAsset and the provider who registered it.

ProviderDid
type: ObjectProperty
inverse of: provide
domain: Dataset
range: Provider
comment: The Provider Did

queryFilters
type: ObjectProperty
domain: datasetQuery
range: QueryFilters
comment: queryFilters

serviceSpecs
type: ObjectProperty
domain: Data service
range: itsoServiceSpecs
comment: Relation between an DataService and the serviceSpecs.

sourceOrganization
type: ObjectProperty
domain: Consumer
domain: Owner
domain: Provider
range: Organization
comment: sourceOrganization

subscribedQuery
type: ObjectProperty
domain: datasetSubscription
range: datasetQuery
comment: Relation between an dataAsset subscription and the dataAsset query that matched the dataAsset.

subscribedTo
type: ObjectProperty
domain: Consumer
range: Dataset
comment: subscribedTo

subscribesTo
type: ObjectProperty
domain: datasetSubscription
range: Dataset
comment: Relation between a subscription and the dataAsset it subscribes to.

has broader match
type: ObjectProperty
sub property of: has broader
sub property of: is in mapping relation with
inverse of: has narrower match
definition: skos:broadMatch is used to state a hierarchical mapping link between two conceptual resources in different concept schemes.

has broader
type: ObjectProperty
sub property of: has broader transitive
comment: Broader concepts are typically rendered as parents in a concept hierarchy (tree).
definition: Relates a concept to a concept that is more general in meaning.
scope note: By convention, skos:broader is only used to assert an immediate (i.e. direct) hierarchical link between two conceptual resources.

has broader transitive
type: ObjectProperty
sub property of: is in semantic relation with
inverse of: has narrower transitive
type: TransitiveProperty
definition: skos:broaderTransitive is a transitive superproperty of skos:broader.
scope note: By convention, skos:broaderTransitive is not used to make assertions. Rather, the properties can be used to draw inferences about the transitive closure of the hierarchical relation, which is useful e.g. when implementing a simple query expansion algorithm in a search application.

has close match
type: ObjectProperty
sub property of: is in mapping relation with
type: SymmetricProperty
definition: skos:closeMatch is used to link two concepts that are sufficiently similar that they can be used interchangeably in some information retrieval applications. In order to avoid the possibility of "compound errors" when combining mappings across more than two concept schemes, skos:closeMatch is not declared to be a transitive property.

has exact match
type: ObjectProperty
sub property of: has close match
type: SymmetricProperty
type: TransitiveProperty
comment: skos:exactMatch is disjoint with each of the properties skos:broadMatch and skos:relatedMatch.
definition: skos:exactMatch is used to link two concepts, indicating a high degree of confidence that the concepts can be used interchangeably across a wide range of information retrieval applications. skos:exactMatch is a transitive property, and is a sub-property of skos:closeMatch.

has top concept
type: ObjectProperty
inverse of: is top concept in scheme
domain: Concept Scheme
range: Concept
definition: Relates, by convention, a concept scheme to a concept which is topmost in the broader/narrower concept hierarchies for that scheme, providing an entry point to these hierarchies.

is in scheme
type: ObjectProperty
range: Concept Scheme
definition: Relates a resource (for example a concept) to a concept scheme in which it is included.
scope note: A concept may be a member of more than one concept scheme.

is in mapping relation with
type: ObjectProperty
sub property of: is in semantic relation with
comment: These concept mapping relations mirror semantic relations, and the data model defined below is similar (with the exception of skos:exactMatch) to the data model defined for semantic relations. A distinct vocabulary is provided for concept mapping relations, to provide a convenient way to differentiate links within a concept scheme from links between concept schemes. However, this pattern of usage is not a formal requirement of the SKOS data model, and relies on informal definitions of best practice.
definition: Relates two concepts coming, by convention, from different schemes, and that have comparable meanings

has member
type: ObjectProperty
domain: Collection
range: Class
  union of: Collection
  union of: Concept
definition: Relates a collection to one of its members.

has member list
type: ObjectProperty
type: FunctionalProperty
domain: Ordered Collection
range: List
comment: For any resource, every item in the list given as the value of the skos:memberList property is also a value of the skos:member property.
definition: Relates an ordered collection to the RDF list containing its members.

has narrower match
type: ObjectProperty
sub property of: is in mapping relation with
sub property of: has narrower
definition: skos:narrowMatch is used to state a hierarchical mapping link between two conceptual resources in different concept schemes.

has narrower
type: ObjectProperty
sub property of: has narrower transitive
inverse of: has broader
comment: Narrower concepts are typically rendered as children in a concept hierarchy (tree).
definition: Relates a concept to a concept that is more specific in meaning.
scope note: By convention, skos:broader is only used to assert an immediate (i.e. direct) hierarchical link between two conceptual resources.

has narrower transitive
type: ObjectProperty
sub property of: is in semantic relation with
type: TransitiveProperty
definition: skos:narrowerTransitive is a transitive superproperty of skos:narrower.
scope note: By convention, skos:narrowerTransitive is not used to make assertions. Rather, the properties can be used to draw inferences about the transitive closure of the hierarchical relation, which is useful e.g. when implementing a simple query expansion algorithm in a search application.

has related
type: ObjectProperty
sub property of: is in semantic relation with
type: SymmetricProperty
comment: skos:related is disjoint with skos:broaderTransitive
definition: Relates a concept to a concept with which there is an associative semantic relationship.

has related match
type: ObjectProperty
sub property of: is in mapping relation with
sub property of: has related
type: SymmetricProperty
definition: skos:relatedMatch is used to state an associative mapping link between two conceptual resources in different concept schemes.

is in semantic relation with
type: ObjectProperty
domain: Concept
range: Concept
definition: Links a concept to a concept related by meaning.
scope note: This property should not be used directly, but as a super-property for all properties denoting a relationship of meaning between concepts.

is top concept in scheme
type: ObjectProperty
sub property of: is in scheme
domain: Concept
range: Concept Scheme
definition: Relates a concept to the concept scheme that it is a top level concept of.

data access service
type: ObjectProperty
range: Data service
comment: A site or end-point that gives access to the distribution of the dataset.
comment: Et websted eller endpoint der giver adgang til en repræsentation af datasættet. @da
comment: Umístění či přístupový bod zpřístupňující distribuci datové sady. @cs
comment: Un sitio o end-point que da acceso a la distribución de un conjunto de datos. @es
comment: Un sito o end-point che dà accesso alla distribuzione del set di dati. @it
label: dataadgangstjeneste @da
label: servicio de acceso de datos @es
label: servizio di accesso ai dati @it
label: služba pro přístup k datům @cs
change note: New property added in DCAT 2.
change note: Nová vlastnost přidaná ve verzi DCAT 2. @cs
change note: Nueva propiedad agregada en DCAT 2. @es
change note: Nuova proprietà aggiunta in DCAT 2. @it
change note: Ny egenskab tilføjet i DCAT 2. @da

access address
type: ObjectProperty
domain: Distribuce
range: Resource
property chain axiom: data access service
property chain axiom: service end-point
comment: A URL of a resource that gives access to a distribution of the dataset. E.g. landing page, feed, SPARQL endpoint. Use for all cases except a simple download link, in which case downloadURL is preferred.
comment: Ceci peut être tout type d'URL qui donne accès à une distribution du jeu de données. Par exemple, un lien à une page HTML contenant un lien au jeu de données, un Flux RSS, un point d'accès SPARQL. Utilisez le lorsque votre catalogue ne contient pas d'information sur quoi il est ou quand ce n'est pas téléchargeable. @fr
comment: En URL for en ressource som giver adgang til en repræsentation af datsættet. Fx destinationsside, feed, SPARQL-endpoint. Anvendes i alle sammenhænge undtagen til angivelse af et simpelt download link hvor anvendelse af egenskaben downloadURL foretrækkes. @da
comment: Puede ser cualquier tipo de URL que de acceso a una distribución del conjunto de datos, e.g., página de destino, descarga, URL feed, punto de acceso SPARQL. Esta propriedad se debe usar cuando su catálogo de datos no tiene información sobre donde está o cuando no se puede descargar. @es
comment: URL zdroje, přes které je přístupná distribuce datové sady. Příkladem může být vstupní stránka, RSS kanál či SPARQL endpoint. Použijte ve všech případech kromě URL souboru ke stažení, pro které je lepší použít dcat:downloadURL. @cs
comment: Un URL di una risorsa che consente di accedere a una distribuzione del set di dati. Per esempio, pagina di destinazione, feed, endpoint SPARQL. Da utilizzare per tutti i casi, tranne quando si tratta di un semplice link per il download nel qual caso è preferito downloadURL. @it
comment: Μπορεί να είναι οποιουδήποτε είδους URL που δίνει πρόσβαση στη διανομή ενός συνόλου δεδομένων. Π.χ. ιστοσελίδα αρχικής πρόσβασης, μεταφόρτωση, feed URL, σημείο διάθεσης SPARQL. Να χρησιμοποιείται όταν ο κατάλογος δεν περιέχει πληροφορίες εαν πρόκειται ή όχι για μεταφορτώσιμο αρχείο. @el
comment: أي رابط يتيح الوصول إلى البيانات. إذا كان الرابط هو ربط مباشر لملف يمكن تحميله استخدم الخاصية downloadURL @ar
comment: データセットの配信にアクセス権を与えるランディング・ページ、フィード、SPARQLエンドポイント、その他の種類の資源。 @ja
label: URL d'accès @fr
label: URL de acceso @es
label: URL πρόσβασης @el
label: adgangsadresse @da
label: indirizzo di accesso @it
label: přístupová adresa @cs
label: رابط وصول @ar
label: アクセスURL @ja
alternative label: adgangsURL @da
editorial note: Status: English Definition text modified by DCAT revision team, updated Italian and Czech translation provided, translations for other languages pending.
editorial note: rdfs:label, rdfs:comment and skos:scopeNote have been modified. Non-english versions except for Italian must be updated.
scope note: El rango es una URL. Si la distribución es accesible solamente través de una página de destino (es decir, si no se conoce una URL de descarga directa), entonces el enlance a la página de destino debe ser duplicado como accessURL en la distribución. @es
scope note: Hvis en eller flere distributioner kun er tilgængelige via en destinationsside (dvs. en URL til direkte download er ikke kendt), så bør destinationssidelinket gentages som adgangsadresse for distributionen. @da
scope note: If the distribution(s) are accessible only through a landing page (i.e. direct download URLs are not known), then the landing page link should be duplicated as accessURL on a distribution.
scope note: La valeur est une URL. Si la distribution est accessible seulement au travers d'une page d'atterrissage (c-à-dire on n'ignore une URL de téléchargement direct), alors le lien à la page d'atterrissage doit être dupliqué comee accessURL sur la distribution. @fr
scope note: Pokud jsou distribuce přístupné pouze přes vstupní stránku (tj. URL pro přímé stažení nejsou známa), pak by URL přístupové stránky mělo být duplikováno ve vlastnosti distribuce accessURL. @cs
scope note: Se le distribuzioni sono accessibili solo attraverso una pagina web (ad esempio, gli URL per il download diretto non sono noti), allora il link della pagina web deve essere duplicato come accessURL sulla distribuzione. @it
scope note: Η τιμή είναι ένα URL. Αν η/οι διανομή/ές είναι προσβάσιμη/ες μόνο μέσω μίας ιστοσελίδας αρχικής πρόσβασης (δηλαδή αν δεν υπάρχουν γνωστές διευθύνσεις άμεσης μεταφόρτωσης), τότε ο σύνδεσμος της ιστοσελίδας αρχικής πρόσβασης πρέπει να αναπαραχθεί ως accessURL σε μία διανομή. @el
scope note: 確実にダウンロードでない場合や、ダウンロードかどうかが不明である場合は、downloadURLではなく、accessURLを用いてください。ランディング・ページを通じてしか配信にアクセスできない場合（つまり、直接的なダウンロードURLが不明）は、配信におけるaccessURLとしてランディング・ページのリンクをコピーすべきです（SHOULD）。 @ja

catalog
type: ObjectProperty
sub property of: resource
domain: Catalog
range: Catalog
comment: A catalog that is listed in the catalog.
comment: Et katalog hvis indhold er relevant i forhold til det aktuelle katalog. @da
comment: Katalog, jehož obsah je v kontextu tohoto katalogu zajímavý. @cs
comment: Un catalogo i cui contenuti sono di interesse nel contesto di questo catalogo. @it
comment: Un catálogo cuyo contenido es de interés en el contexto del catálogo que está siendo descripto. @es
label: catalogo @it
label: catálogo @es
label: katalog @cs
alternative label: har delkatalog @da
alternative label: has catalog
change note: New property added in DCAT 2.
change note: Nová vlastnost přidaná ve verzi DCAT 2. @cs
change note: Nueva propiedad agregada en DCAT 2. @es
change note: Nuova proprietà aggiunta in DCAT 2. @it
editorial note: Status: English Definition text modified by DCAT 3 revision team, translations pending.

compression format
type: ObjectProperty
sub property of: Format
domain: Distribuce
range: Media Type
comment: El formato de la distribución en el que los datos están en forma comprimida, e.g. para reducir el tamaño del archivo a bajar. @es
comment: Formát komprese souboru, ve kterém jsou data poskytována v komprimované podobě, např. ke snížení velikosti souboru ke stažení. @cs
comment: Il formato di compressione della distribuzione nel quale i dati sono in forma compressa, ad es. per ridurre le dimensioni del file da scaricare. @it
comment: Kompressionsformatet for distributionen som indeholder data i et komprimeret format, fx for at reducere størrelsen af downloadfilen. @da
comment: The compression format of the distribution in which the data is contained in a compressed form, e.g. to reduce the size of the downloadable file.
label: formato de compresión @es
label: formato di compressione @it
label: formát komprese @cs
label: kompressionsformat @da
change note: New property added in DCAT 2.
change note: Nová vlastnost přidaná ve verzi DCAT 2. @cs
change note: Nueva propiedad agregada en DCAT 2. @es
change note: Nuova proprietà aggiunta in DCAT 2. @it
change note: Ny egenskab tilføjet i DCAT 2. @da
scope note: Denne egenskab kan anvendes når filerne i en distribution er blevet komprimeret, fx i en ZIP-fil. Formatet BØR udtrykkes ved en medietype som defineret i 'IANA media types registry', hvis der optræder en relevant medietype dér: https://www.iana.org/assignments/media-types/. @da
scope note: Esta propiedad se debe usar cuando los archivos de la distribución están comprimidos, por ejemplo en un archivo ZIP. El formato DEBERÍA expresarse usando un 'media type', tales como los definidos en el registro IANA de 'media types' https://www.iana.org/assignments/media-types/, si está disponibles. @es
scope note: Questa proprietà deve essere utilizzata quando i file nella distribuzione sono compressi, ad es. in un file ZIP. Il formato DOVREBBE essere espresso usando un tipo di media come definito dal registro dei tipi di media IANA https://www.iana.org/assignments/media-types/, se disponibile. @it
scope note: Tato vlastnost se použije, když jsou soubory v distribuci komprimovány, např. v ZIP souboru. Formát BY MĚL být vyjádřen pomocí typu média definovaného v registru IANA https://www.iana.org/assignments/media-types/, pokud existuje. @cs
scope note: This property is to be used when the files in the distribution are compressed, e.g. in a ZIP file. The format SHOULD be expressed using a media type as defined by IANA media types registry https://www.iana.org/assignments/media-types/, if available.

contact point
type: ObjectProperty
range: Kind
comment: Información relevante de contacto para el recurso catalogado. Se recomienda el uso de vCard. @es
comment: Informazioni di contatto rilevanti per la risorsa catalogata. Si raccomanda l'uso di vCard. @it
comment: Relevant contact information for the catalogued resource. Use of vCard is recommended.
comment: Relevante kontaktoplysninger for den katalogiserede ressource. Anvendelse af vCard anbefales. @da
comment: Relevantní kontaktní informace pro katalogizovaný zdroj. Doporučuje se použít slovník VCard. @cs
comment: Relie un jeu de données à une information de contact utile en utilisant VCard. @fr
comment: Συνδέει ένα σύνολο δεδομένων με ένα σχετικό σημείο επικοινωνίας, μέσω VCard. @el
comment: تربط قائمة البيانات بعنوان اتصال موصف باستخدام VCard @ar
comment: データセットを、VCardを用いて提供されている適切な連絡先情報にリンクします。 @ja
label: Punto de contacto @es
label: kontaktní bod @cs
label: kontaktpunkt @da
label: point de contact @fr
label: punto di contatto @it
label: σημείο επικοινωνίας @el
label: عنوان اتصال @ar
label: 窓口 @ja
editorial note: Status: English Definition text modified by DCAT revision team, Italian, Spanish and Czech translations provided, other translations pending.

dataset
type: ObjectProperty
sub property of: resource
domain: Catalog
range: Dataset
comment: A dataset that is listed in the catalog.
comment: En samling af data som er opført i kataloget. @da
comment: Kolekce dat, která je katalogizována v katalogu. @cs
comment: Relie un catalogue à un jeu de données faisant partie de ce catalogue. @fr
comment: Un conjunto de datos que se lista en el catálogo. @es
comment: Una raccolta di dati che è elencata nel catalogo. @it
comment: Συνδέει έναν κατάλογο με ένα σύνολο δεδομένων το οποίο ανήκει στον εν λόγω κατάλογο. @el
comment: تربط الفهرس بقائمة بيانات ضمنه @ar
comment: カタログの一部であるデータセット。 @ja
label: conjunto de datos @es
label: datasæt @da
label: datová sada @cs
label: jeu de données @fr
label: σύνολο δεδομένων @el
label: قائمة بيانات @ar
label: データセット @ja
alternative label: datasamling @da
alternative label: har datasæt @da
alternative label: has dataset
editorial note: Status: English Definition text modified by DCAT 3 revision team, translations pending.

distribuce
type: ObjectProperty
sub property of: Relation
domain: Dataset
range: Distribuce
comment: An available distribution of the dataset.
comment: Connecte un jeu de données à des distributions disponibles. @fr
comment: Dostupná distribuce datové sady. @cs
comment: En tilgængelig repræsentation af datasættet. @da
comment: Una distribución disponible del conjunto de datos. @es
comment: Una distribuzione disponibile per il set di dati. @it
comment: Συνδέει ένα σύνολο δεδομένων με μία από τις διαθέσιμες διανομές του. @el
comment: تربط قائمة البيانات بطريقة أو بشكل يسمح الوصول الى البيانات @ar
comment: データセットを、その利用可能な配信に接続します。 @ja
label: distribución @es
label: distribution
label: distribuzione @it
label: διανομή @el
label: توزيع @ar
label: データセット配信 @ja
alternative label: har distribution @da
alternative label: has distribution
editorial note: Status: English Definition text modified by DCAT revision team, translations pending (except for Italian, Spanish and Czech).

download URL
type: ObjectProperty
domain: Distribuce
range: Resource
comment: Ceci est un lien direct à un fichier téléchargeable en un format donnée. Exple fichier CSV ou RDF. Le format est décrit par les propriétés de distribution dcterms:format et/ou dcat:mediaType. @fr
comment: La URL de un archivo descargable en el formato dato. Por ejemplo, archivo CSV o archivo RDF. El formato se describe con las propiedades de la distribución dcterms:format y/o dcat:mediaType. @es
comment: Questo è un link diretto al file scaricabile in un dato formato. E.g. un file CSV o un file RDF. Il formato è descritto dal dcterms:format e/o dal dcat:mediaType della distribuzione. @it
comment: The URL of the downloadable file in a given format. E.g. CSV file or RDF file. The format is indicated by the distribution's dcterms:format and/or dcat:mediaType.
comment: URL souboru ke stažení v daném formátu, například CSV nebo RDF soubor. Formát je popsán vlastností distribuce dcterms:format a/nebo dcat:mediaType. @cs
comment: URL til fil der kan downloades i et bestemt format. Fx en CSV-fil eller en RDF-fil. Formatet for distributionen angives ved hjælp af egenskaberne dcterms:format og/eller dcat:mediaType. @da
comment: dcat:downloadURLはdcat:accessURLの特定の形式です。しかし、DCATプロファイルが非ダウンロード・ロケーションに対してのみaccessURLを用いる場合には、より強い分離を課すことを望む可能性があるため、この含意を強化しないように、DCATは、dcat:downloadURLをdcat:accessURLのサブプロパティーであると定義しません。 @ja
comment: Είναι ένας σύνδεσμος άμεσης μεταφόρτωσης ενός αρχείου σε μια δεδομένη μορφή. Π.χ. ένα αρχείο CSV ή RDF. Η μορφη αρχείου περιγράφεται από τις ιδιότητες dcterms:format ή/και dcat:mediaType της διανομής. @el
comment: رابط مباشر لملف يمكن تحميله. نوع الملف يتم توصيفه باستخدام الخاصية dcterms:format dcat:mediaType @ar
label: URL de descarga @es
label: URL de téléchargement @fr
label: URL di scarico @it
label: URL souboru ke stažení @cs
label: URL μεταφόρτωσης @el
label: downloadURL @da
label: رابط تحميل @ar
label: ダウンロードURL @ja
editorial note: Status: English Definition text modified by DCAT revision team, Italian, Spanish and Czech translation updated, other translations pending.
editorial note: rdfs:label, rdfs:comment and/or skos:scopeNote have been modified. Non-english versions must be updated.
scope note: El valor es una URL. @es
scope note: La valeur est une URL. @fr
scope note: dcat:downloadURL BY MĚLA být použita pro adresu, ze které je distribuce přímo přístupná, typicky skrze požadavek HTTP Get. @cs
scope note: dcat:downloadURL BØR anvendes til angivelse af den adresse hvor distributionen er tilgængelig direkte, typisk gennem et HTTP Get request. @da
scope note: dcat:downloadURL DOVREBBE essere utilizzato per l'indirizzo a cui questa distribuzione è disponibile direttamente, in genere attraverso una richiesta Get HTTP. @it
scope note: dcat:downloadURL SHOULD be used for the address at which this distribution is available directly, typically through a HTTP Get request.
scope note: Η τιμή είναι ένα URL. @el

description of service end-point
type: ObjectProperty
domain: Data service
comment: A description of the service end-point, including its operations, parameters etc.
comment: En beskrivelse af det pågældende tjenesteendpoint, inklusiv dets operationer, parametre etc. @da
comment: Popis přístupového bodu služby včetně operací, parametrů apod. @cs
comment: Una descripción del end-point del servicio, incluyendo sus operaciones, parámetros, etc. @es
comment: Una descrizione dell'endpoint del servizio, incluse le sue operazioni, parametri, ecc. @it
label: descripción del end-point del servicio @es
label: descrizione dell'endpoint del servizio @it
label: endpointbeskrivelse @da
label: popis přístupového bodu služby @cs
change note: New property in DCAT 2.
change note: Nová vlastnost přidaná ve verzi DCAT 2. @cs
change note: Nueva propiedad agregada en DCAT 2.
change note: Nuova proprietà in DCAT 2. @it
change note: Ny egenskab i DCAT 2. @da
definition: Una descripción del end-point del servicio, incluyendo sus operaciones, parámetros, etc.. @es
scope note: An endpoint description may be expressed in a machine-readable form, such as an OpenAPI (Swagger) description, an OGC GetCapabilities response, a SPARQL Service Description, an OpenSearch or WSDL document, a Hydra API description, else in text or some other informal mode if a formal representation is not possible.
scope note: En beskrivelse af et endpoint kan udtrykkes i et maskinlæsbart format, såsom OpenAPI (Swagger)-beskrivelser, et OGC GetCapabilities svar, en SPARQL tjenestebeskrivelse, en OpenSearch- eller et WSDL-dokument, en Hydra-API-beskrivelse, eller i tekstformat eller i et andet uformelt format, hvis en formel repræsentation ikke er mulig. @da
scope note: Endpointbeskrivelsen giver specifikke oplysninger om den konkrete endpointinstans, mens dcterms:conformsTo anvendes til at indikere den overordnede standard eller specifikation som endpointet er i overensstemmelse med. @da
scope note: La descripción del endpoint brinda detalles específicos de la instancia del endpoint, mientras que dcterms:conformsTo se usa para indicar el estándar general o especificación que implementa el endpoint. @es
scope note: La descrizione dell'endpoint fornisce dettagli specifici dell'istanza dell'endpoint reale, mentre dcterms:conformsTo viene utilizzato per indicare lo standard o le specifiche implementate dall'endpoint. @it
scope note: Popis přístupového bodu dává specifické detaily jeho konkrétní instance, zatímco dcterms:conformsTo indikuje obecný standard či specifikaci kterou přístupový bod implementuje. @cs
scope note: Popis přístupového bodu může být vyjádřen ve strojově čitelné formě, například jako popis OpenAPI (Swagger), odpověď služby OGC getCapabilities, pomocí slovníku SPARQL Service Description, jako OpenSearch či WSDL document, jako popis API dle slovníku Hydra, a nebo textově nebo jiným neformálním způsobem, pokud není možno použít formální reprezentaci. @cs
scope note: The endpoint description gives specific details of the actual endpoint instance, while dcterms:conformsTo is used to indicate the general standard or specification that the endpoint implements.
scope note: Una descripción del endpoint del servicio puede expresarse en un formato que la máquina puede interpretar, tal como una descripción basada en OpenAPI (Swagger), una respuesta OGC GetCapabilities, una descripción de un servicio SPARQL, un documento OpenSearch o WSDL, una descripción con la Hydra API, o en texto u otro modo informal si la representación formal no es posible. @es
scope note: Una descrizione dell'endpoint può essere espressa in un formato leggibile dalla macchina, come una descrizione OpenAPI (Swagger), una risposta GetCapabilities OGC, una descrizione del servizio SPARQL, un documento OpenSearch o WSDL, una descrizione API Hydra, o con del testo o qualche altra modalità informale se una rappresentazione formale non è possibile. @it

service end-point
type: ObjectProperty
domain: Data service
range: Resource
comment: Kořenové umístění nebo hlavní přístupový bod služby (IRI přístupné přes Web). @cs
comment: La locazione principale o l'endpoint primario del servizio (un IRI risolvibile via web). @it
comment: La posición raíz o end-point principal del servicio (una IRI web). @es
comment: Rodplaceringen eller det primære endpoint for en tjeneste (en web-resolverbar IRI). @da
comment: The root location or primary endpoint of the service (a web-resolvable IRI).
label: end-point del servicio @es
label: end-point del servizio @it
label: přístupový bod služby @cs
label: tjenesteendpoint @da
change note: New property in DCAT 2.
change note: Nová vlastnost přidaná ve verzi DCAT 2. @cs
change note: Nueva propiedad agregada en DCAT 2. @es
change note: Nuova proprietà in DCAT 2. @it

first
type: ObjectProperty
sub property of: first
comment: El primer recurso en una colección ordenada o serie de recursos, al que el recurso pertenece. @es
comment: La prima risorsa in una collezione ordinata o in una serie di risorse, di cui la risorsa fa parte. @it
comment: The first resource in an ordered collection or series of resources, to which the current resource belongs.
label: primero @es
label: primo @it
change note: New property added in DCAT 3.
change note: Nová vlastnost přidaná ve verzi DCAT 3. @cs
change note: Nueva propiedad agregada in DCAT 3. @es
change note: Nuova proprietà aggiunta in DCAT 3. @it
change note: Ny egenskab tilføjet i DCAT 3. @da
scope note: En DCAT esta propiedad se usa para recursos que pertenecen a una dcat:DatasetSeries. @es
scope note: In DCAT questa proprietà è usata per risorse che fanno parte di una dcat:DatasetSeries. @it
scope note: In DCAT this property is used for resources belonging to a dcat:DatasetSeries.

hadRole
type: ObjectProperty
domain: Class
  union of: Relationship
  union of: Attribution
range: Rol
comment: Den funktion en entitet eller aktør har i forhold til en anden ressource. @da
comment: Funkce entity či agenta ve vztahu k jiné entitě či zdroji. @cs
comment: La función de una entidad o agente con respecto a otra entidad o recurso. @es
comment: La funzione di un'entità o un agente rispetto ad un'altra entità o risorsa. @it
comment: The function of an entity or agent with respect to another entity or resource.
label: haRuolo @it
label: havde rolle @da
label: sehraná role @cs
label: tiene rol @it
change note: New property added in DCAT 2.
change note: Nová vlastnost přidaná ve verzi DCAT 2. @cs
change note: Nueva propiedad agregada en DCAT 2. @es
change note: Nuova proprietà aggiunta in DCAT 2. @it
editorial note: Agregada en DCAT para complementar prov:hadRole (cuyo uso está limitado a roles en el contexto de una actividad, con dominio prov:Association. @es
editorial note: Introdotta in DCAT per completare prov:hadRole (il cui uso è limitato ai ruoli nel contesto di un'attività, con il dominio di prov:Association. @it
editorial note: Introduced into DCAT to complement prov:hadRole (whose use is limited to roles in the context of an activity, with the domain of prov:Association.
editorial note: Introduceret i DCAT for at supplere prov:hadRole (hvis anvendelse er begrænset til roller i forbindelse med en aktivitet med domænet prov:Association). @da
editorial note: Přidáno do DCAT pro doplnění vlastnosti prov:hadRole (jejíž užití je omezeno na role v kontextu aktivity, s definičním oborem prov:Association). @cs
scope note: Kan vendes ved kvalificerede krediteringer til at angive en aktørs rolle i forhold en entitet. Det anbefales at værdierne styres som et kontrolleret udfaldsrum med aktørroller, såsom http://registry.it.csiro.au/def/isotc211/CI_RoleCode. @da
scope note: May be used in a qualified-attribution to specify the role of an Agent with respect to an Entity. It is recommended that the value be taken from a controlled vocabulary of agent roles, such as http://registry.it.csiro.au/def/isotc211/CI_RoleCode.
scope note: May be used in a qualified-relation to specify the role of an Entity with respect to another Entity. It is recommended that the value be taken from a controlled vocabulary of entity roles such as: ISO 19115 DS_AssociationTypeCode http://registry.it.csiro.au/def/isotc211/DS_AssociationTypeCode; IANA Registry of Link Relations https://www.iana.org/assignments/link-relation; DataCite metadata schema; MARC relators https://id.loc.gov/vocabulary/relators.
scope note: Může být použito v kvalifikovaném přiřazení pro specifikaci role Agenta ve vztahu k Entitě. Je doporučeno hodnotu vybrat z řízeného slovníku rolí agentů, jako například http://registry.it.csiro.au/def/isotc211/CI_RoleCode. @cs
scope note: Může být použito v kvalifikovaném vztahu pro specifikaci role Entity ve vztahu k jiné Entitě. Je doporučeno použít hodnotu z řízeného slovníku rolí entit, jako například ISO 19115 DS_AssociationTypeCode http://registry.it.csiro.au/def/isotc211/DS_AssociationTypeCode, IANA Registry of Link Relations https://www.iana.org/assignments/link-relation, DataCite metadata schema, MARC relators https://id.loc.gov/vocabulary/relators. @cs
scope note: Puede usarse en una atribución cualificada para especificar el rol de un Agente con respecto a una Entidad. Se recomienda que el valor sea de un vocabulario controlado de roles de agentes, como por ejemplo http://registry.it.csiro.au/def/isotc211/CI_RoleCode. @es
scope note: Puede usarse en una atribución cualificada para especificar el rol de una Entidad con respecto a otra Entidad. Se recomienda que su valor se tome de un vocabulario controlado de roles de entidades como por ejemplo: ISO 19115 DS_AssociationTypeCode http://registry.it.csiro.au/def/isotc211/DS_AssociationTypeCode; IANA Registry of Link Relations https://www.iana.org/assignments/link-relation; esquema de metadatos de DataCite; MARC relators https://id.loc.gov/vocabulary/relators. @es
scope note: Può essere utilizzata in una relazione qualificata per specificare il ruolo di un'entità rispetto a un'altra entità. Si raccomanda che il valore sia preso da un vocabolario controllato di ruoli di entità come ISO 19115 DS_AssociationTypeCode http://registry.it.csiro.au/def/isotc211/DS_AssociationTypeCode, IANA Registry of Link Relations https://www.iana.org/assignments/link-relation, DataCite metadata schema, o MARC relators https://id.loc.gov/vocabulary/relators. @it
scope note: Può essere utilizzato in un'attribuzione qualificata per specificare il ruolo di un agente rispetto a un'entità. Si raccomanda che il valore sia preso da un vocabolario controllato di ruoli di agente, come ad esempio http://registry.it.csiro.au/def/isotc211/CI_RoleCode. @it

has current version
type: ObjectProperty
sub property of: hasVersion
comment: Este recurso es más específico y versionado con contenido equivalente [PAV]. @es
comment: Per questa risorsa esiste una risorsa più specifica e versionata, ma con lo stesso contenuto. @it
comment: This resource has a more specific, versioned resource with equivalent content [PAV].
label: ha versione attuale @it
label: tiene versión actual @es
change note: New property added in DCAT 3.
change note: Nová vlastnost přidaná ve verzi DCAT 3. @cs
change note: Nueva propiedad agregada in DCAT 3. @es
change note: Nuova proprietà aggiunta in DCAT 3. @it
change note: Ny egenskab tilføjet i DCAT 3. @da
scope note: Esta propepiedad está destinada a relacionar un recurso no versionado o abstracto con una versión instantánea que puede usarse como un enlace permanente a la versión actual del recurso [PAV]. @es
scope note: La noción de versión que se usa en esta propiedad está limitada a las versiones que resultan de revisiones de un recurso como parte de su ciclo de vida. @es
scope note: La nozione di versione usata da questa proprietà è limitata a versioni risultanti da revisioni a cui una risorsa è soggetta nel suo ciclo di vita. @it
scope note: Questa proprietà è usata per correlare una risorsa non versionata o astratta a un suo specifico snapshot che può essere usato come permalink per indicare la versione attuale del suo contenuto. @it
scope note: The notion of version used by this property is limited to versions resulting from revisions occurring to a resource as part of its life-cycle.
scope note: This property is intended for relating a non-versioned or abstract resource to a single snapshot that can be used as a permalink to indicate the current version of the content [PAV].

has version
type: ObjectProperty
sub property of: Has Version
sub property of: generalizationOf
comment: Este recurso tiene una versión específica. @es
comment: Per questa risorsa esiste una risorsa più specifica e versionata. @it
comment: This resource has a more specific, versioned resource [PAV].
label: ha versione @it
label: tiene versión @es
change note: New property added in DCAT 3.
change note: Nová vlastnost přidaná ve verzi DCAT 3. @cs
change note: Nueva propiedad agregada in DCAT 3. @es
change note: Nuova proprietà aggiunta in DCAT 3. @it
change note: Ny egenskab tilføjet i DCAT 3. @da
scope note: Esta propiedad se utiliza para relacionar un recurso abstracto o no versionado de un recurso con varias versiones del recuros; por ejemplo, versiones intastáneas. @es
scope note: La noción de versión que se usa en esta propiedad está limitada a las versiones que resultan de revisiones de un recurso como parte de su ciclo de vida. Por lo tanto, su semántica es más específica que su super-propiedad dcterns:hasVersion, la cuál hace uso de la noción más amplia de versión, incluyendo ediciones y adaptaciones. @es
scope note: La nozione di versione usata da questa proprietà è limitata a versioni risultanti da revisioni a cui una risorsa è soggetta nel suo ciclo di vita. Quindi la sua semantica è più specifica di quella della sua super-proprietà dcterms:hasVersion, che utilizza una nozione di versione più ampia, e include, ad es., edizioni e adattamenti. @it
scope note: Questa proprietà è usata per correlare una risorsa non versionata o astratta a differenti risorse versionate, ad es., i relativi snapshot. @it
scope note: The notion of version used by this property is limited to versions resulting from revisions occurring to a resource as part of its life-cycle. Therefore, its semantics is more specific than its super-property dcterms:hasVersion, which makes use of a broader notion of version, including editions and adaptations.
scope note: This property is intended for relating a non-versioned or abstract resource to several versioned resources, e.g., snapshots [PAV].

inCatalog
type: ObjectProperty
inverse of: resource
change note: New property added in DCAT 3.
change note: Nová vlastnost přidaná ve verzi DCAT 3. @cs
change note: Nueva propiedad agregada en DCAT 3. @es
change note: Nuova proprietà aggiunta in DCAT 3. @it
scope note: Esta propiedad inversa PUEDE usarse sólo en combinación con su inversa, y NO PUEDE utilizarse en su reemplazo. @es
scope note: Questa proprietà PUÒ essere usata solo insieme alla sua inversa, e NON DEVE essere usata per sostituirla. @it
scope note: This property MAY be used only in addition to its inverse, and it MUST NOT be used to replace it.

in series
type: ObjectProperty
sub property of: Is Part Of
comment: A dataset series of which the dataset is part.
comment: Una serie de conjuntos de datos del cuál un conjunto de datos es parte. @es
comment: Una serie di dataset di cui questo dataset fa parte. @it
label: en serie @es
label: in serie @it
change note: New property added in DCAT 3.
change note: Nová vlastnost přidaná ve verzi DCAT 3. @cs
change note: Nueva propiedad agregada in DCAT 3. @es
change note: Nuova proprietà aggiunta in DCAT 3. @it
change note: Ny egenskab tilføjet i DCAT 3. @da

isDistributionOf
type: ObjectProperty
inverse of: distribuce
change note: New property added in DCAT 3.
change note: Nová vlastnost přidaná ve verzi DCAT 3. @cs
change note: Nueva propiedad agregada en DCAT 3. @es
change note: Nuova proprietà aggiunta in DCAT 3. @it
scope note: Esta propiedad inversa PUEDE usarse sólo en combinación con su inversa, y NO PUEDE utilizarse en su reemplazo. @es
scope note: Questa proprietà PUÒ essere usata solo insieme alla sua inversa, e NON DEVE essere usata per sostituirla. @it
scope note: This property MAY be used only in addition to its inverse, and it MUST NOT be used to replace it.

isVersionOf
type: ObjectProperty
inverse of: has version
change note: New property added in DCAT 3.
change note: Nová vlastnost přidaná ve verzi DCAT 3. @cs
change note: Nueva propiedad agregada en DCAT 3. @es
change note: Nuova proprietà aggiunta in DCAT 3. @it
scope note: Esta propiedad inversa PUEDE usarse sólo en combinación con su inversa, y NO PUEDE utilizarse en su reemplazo. @es
scope note: Questa proprietà PUÒ essere usata solo insieme alla sua inversa, e NON DEVE essere usata per sostituirla. @it
scope note: This property MAY be used only in addition to its inverse, and it MUST NOT be used to replace it.

landing page
type: ObjectProperty
sub property of: page
range: Document
comment: A Web page that can be navigated to in a Web browser to gain access to the catalog, a dataset, its distributions and/or additional information.
comment: En webside som der kan navigeres til i en webbrowser for at få adgang til kataloget, et datasæt, dets distributioner og/eller yderligere information. @da
comment: Una pagina web che può essere navigata per ottenere l'accesso al catalogo, ad un dataset, alle distribuzioni del dataset e/o ad informazioni addizionali. @it
comment: Una página web que puede ser visitada en un explorador Web para tener acceso el catálogo, un conjunto de datos, sus distribuciones y/o información adicional. @es
comment: Une page Web accessible par un navigateur Web donnant accès au catalogue, un jeu de données, ses distributions et/ou des informations additionnelles. @fr
comment: Webová stránka, na kterou lze pro získání přístupu ke katalogu, datové sadě, jejím distribucím a/nebo dalším informacím přistoupit webovým prohlížečem. @cs
comment: Μία ιστοσελίδα πλοηγίσιμη μέσω ενός φυλλομετρητή (Web browser) που δίνει πρόσβαση στο σύνολο δεδομένων, τις διανομές αυτού ή/και επιπρόσθετες πληροφορίες. @el
comment: صفحة وب يمكن من خلالها الوصول الى قائمة البيانات أو إلى معلومات إضافية متعلقة بها @ar
comment: データセット、その配信および（または）追加情報にアクセスするためにウエブ・ブラウザでナビゲートできるウェブページ。 @ja
label: destinationsside @da
label: page d'atterrissage @fr
label: pagina di destinazione @it
label: página de destino @es
label: vstupní stránka @cs
label: ιστοσελίδα αρχικής πρόσβασης @el
label: صفحة وصول @ar
label: ランディング・ページ @ja
definition: En webside som en webbrowser kan navigeres til for at få adgang til kataloget, et datasæt, dets distritbutioner og/eller yderligere information. @da
scope note: Hvis en eller flere distributioner kun er tilgængelige via en destinationsside (dvs. en URL til direkte download er ikke kendt), så bør destinationssidelinket gentages som adgangsadresse for en distribution. @da
scope note: If the distribution(s) are accessible only through a landing page (i.e. direct download URLs are not known), then the landing page link should be duplicated as accessURL on a distribution.
scope note: Pokud je distribuce dostupná pouze přes vstupní stránku, t.j. přímý URL odkaz ke stažení není znám, URL přístupové stránky by mělo být duplikováno ve vlastnosti distribuce accessURL. @cs
scope note: Se la distribuzione è accessibile solo attraverso una pagina di destinazione (cioè, un URL di download diretto non è noto), il link alla pagina di destinazione deve essere duplicato come accessURL sulla distribuzione. @it
scope note: Si la distribución es accesible solamente través de una página de aterrizaje (i.e., no se conoce una URL de descarga directa), entonces el enlance a la página de aterrizaje debe ser duplicado como accessURL sobre la distribución. @es
scope note: Si la distribution est seulement accessible à travers une page d'atterrissage (exple. pas de connaissance d'URLS de téléchargement direct ), alors le lien de la page d'atterrissage doit être dupliqué comme accessURL sur la distribution. @fr
scope note: Αν η/οι διανομή/ές είναι προσβάσιμη/ες μόνο μέσω μίας ιστοσελίδας αρχικής πρόσβασης (δηλαδή αν δεν υπάρχουν γνωστές διευθύνσεις άμεσης μεταφόρτωσης), τότε ο σύνδεσμος της ιστοσελίδας αρχικής πρόσβασης πρέπει να αναπαραχθεί ως accessURL σε μία διανομή. @el
scope note: ランディング・ページを通じてしか配信にアクセスできない場合（つまり、直接的なダウンロードURLが不明）には、配信におけるaccessURLとしてランディング・ページのリンクをコピーすべきです（SHOULD）。 @ja

last
type: ObjectProperty
sub property of: last
comment: El último recurso en una colección ordenada o serie de recursos, al que el recurso pertenece. @es
comment: L'ultima risorsa in una collezione ordinata o in una serie di risorse, di cui la risorsa fa parte. @it
comment: The last resource in an ordered collection or series of resources, to which the current resource belongs.
label: ultimo @it
label: último @es
change note: New property added in DCAT 3.
change note: Nová vlastnost přidaná ve verzi DCAT 3. @cs
change note: Nueva propiedad agregada in DCAT 3. @es
change note: Nuova proprietà aggiunta in DCAT 3. @it
change note: Ny egenskab tilføjet i DCAT 3. @da
scope note: En DCAT esta propiedad se usa para recursos que pertenecen a una dcat:DatasetSeries. @es
scope note: In DCAT questa proprietà è usata per risorse che fanno parte di una dcat:DatasetSeries. @it
scope note: In DCAT this property is used for resources belonging to a dcat:DatasetSeries.

media type
type: ObjectProperty
sub property of: Format
domain: Distribuce
range: Media Type
comment: Cette propriété doit être utilisée quand c'est définit le type de média de la distribution en IANA, sinon dcterms:format DOIT être utilisé avec différentes valeurs. @fr
comment: Esta propiedad debe ser usada cuando está definido el tipo de media de la distribución en IANA, de otra manera dcterms:format puede ser utilizado con diferentes valores @es
comment: Il tipo di media della distribuzione come definito da IANA @it
comment: Medietypen for distributionen som den er defineret af IANA. @da
comment: The media type of the distribution as defined by IANA
comment: Typ média distribuce definovaný v IANA. @cs
comment: Η ιδιότητα αυτή ΘΑ ΠΡΕΠΕΙ να χρησιμοποιείται όταν ο τύπος μέσου μίας διανομής είναι ορισμένος στο IANA, αλλιώς η ιδιότητα dcterms:format ΔΥΝΑΤΑΙ να χρησιμοποιηθεί με διαφορετικές τιμές. @el
comment: يجب استخدام هذه الخاصية إذا كان نوع الملف معرف ضمن IANA @ar
comment: このプロパティーは、配信のメディア・タイプがIANAで定義されているときに使用すべきで（SHOULD）、そうでない場合には、dcterms:formatを様々な値と共に使用できます（MAY）。 @ja
label: medietype @da
label: tipo de media @es
label: tipo di media @it
label: typ média @cs
label: type de média @fr
label: τύπος μέσου @el
label: نوع الميديا @ar
label: メディア・タイプ @ja
change note: Il range di dcat:mediaType è stato ristretto come parte della revisione di DCAT. @it
change note: Obor hodnot dcat:mediaType byl zúžen v této revizi DCAT. @cs
change note: The range of dcat:mediaType has been tightened as part of the revision of DCAT.
definition: Esta propiedad debe ser usada cuando está definido el tipo de media de la distribución en IANA, de otra manera dcterms:format puede ser utilizado con diferentes valores. @es
definition: Il tipo di media della distribuzione come definito da IANA. @it
definition: The media type of the distribution as defined by IANA.
editorial note: Status: English Definition text modified by DCAT revision team, Italian and Czech translation provided, other translations pending. Note some inconsistency on def vs. usage.
scope note: Denne egenskab BØR anvendes hvis distributionens medietype optræder i 'IANA media types registry' https://www.iana.org/assignments/media-types/, ellers KAN egenskaben dcterms:format anvendes med et andet udfaldsrum. @da
scope note: Esta propiedad DEBERÍA usarse cuando el 'media type' de la distribución está definido en el registro IANA de 'media types' https://www.iana.org/assignments/media-types/, de lo contrario, dcterms:format PUEDE usarse con distintos valores. @es
scope note: Questa proprietà DEVE essere usata quando il tipo di media della distribuzione è definito nel registro dei tipi di media IANA https://www.iana.org/assignments/media-types/, altrimenti dcterms:format PUO 'essere usato con differenti valori. @it
scope note: Tato vlastnost BY MĚLA být použita, je-li typ média distribuce definován v registru IANA https://www.iana.org/assignments/media-types/. V ostatních případech MŮŽE být použita vlastnost dcterms:format s jinými hodnotami. @cs
scope note: This property SHOULD be used when the media type of the distribution is defined in the IANA media types registry https://www.iana.org/assignments/media-types/, otherwise dcterms:format MAY be used with different values.

next
type: ObjectProperty
inverse of: previous
change note: New property added in DCAT 3.
change note: Nová vlastnost přidaná ve verzi DCAT 3. @cs
change note: Nueva propiedad agregada en DCAT 3. @es
change note: Nuova proprietà aggiunta in DCAT 3. @it
scope note: Esta propiedad inversa PUEDE usarse sólo en combinación con su inversa, y NO PUEDE utilizarse en su reemplazo. @es
scope note: Questa proprietà PUÒ essere usata solo insieme alla sua inversa, e NON DEVE essere usata per sostituirla. @it
scope note: This property MAY be used only in addition to its inverse, and it MUST NOT be used to replace it.

nextVersion
type: ObjectProperty
inverse of: previous version
change note: New property added in DCAT 3.
change note: Nová vlastnost přidaná ve verzi DCAT 3. @cs
change note: Nueva propiedad agregada en DCAT 3. @es
change note: Nuova proprietà aggiunta in DCAT 3. @it
scope note: Esta propiedad inversa PUEDE usarse sólo en combinación con su inversa, y NO PUEDE utilizarse en su reemplazo. @es
scope note: Questa proprietà PUÒ essere usata solo insieme alla sua inversa, e NON DEVE essere usata per sostituirla. @it
scope note: This property MAY be used only in addition to its inverse, and it MUST NOT be used to replace it.

packaging format
type: ObjectProperty
sub property of: Format
domain: Distribuce
range: Media Type
comment: Balíčkový formát souboru, ve kterém je jeden či více souborů seskupeno dohromady, např. aby bylo možné stáhnout sadu souvisejících souborů naráz. @cs
comment: El formato del archivo en que se agrupan uno o más archivos de datos, e.g. para permitir que un conjunto de archivos relacionados se bajen juntos. @es
comment: Format til pakning af data med henblik på distribution af en eller flere relaterede datafiler der samles til en enhed med henblik på samlet distribution. @da
comment: Il formato di impacchettamento della distribuzione in cui uno o più file di dati sono raggruppati insieme, ad es. per abilitare un insieme di file correlati da scaricare insieme. @it
comment: The package format of the distribution in which one or more data files are grouped together, e.g. to enable a set of related files to be downloaded together.
label: formato de empaquetado @es
label: formato di impacchettamento @it
label: formát balíčku @cs
label: pakkeformat @da
change note: New property added in DCAT 2.
change note: Nová vlastnost přidaná ve verzi DCAT 2. @cs
change note: Nueva propiedad agregada en DCAT 2. @es
change note: Nuova proprietà aggiunta in DCAT 2. @it
change note: Ny egenskab tilføjet i DCAT 2. @da
scope note: Denne egenskab kan anvendes hvis filerne i en distribution er pakket, fx i en TAR-fil, en Frictionless Data Package eller en Bagit-fil. Formatet BØR udtrykkes ved en medietype som defineret i 'IANA media types registry', hvis der optræder en relevant medietype dér: https://www.iana.org/assignments/media-types/. @da
scope note: Esta propiedad se debe usar cuando los archivos de la distribución están empaquetados, por ejemplo en un archivo TAR, Frictionless Data Package o Bagit. El formato DEBERÍA expresarse usando un 'media type', tales como los definidos en el registro IANA de 'media types' https://www.iana.org/assignments/media-types/, si está disponibles. @es
scope note: Questa proprietà deve essere utilizzata quando i file nella distribuzione sono impacchettati, ad esempio in un file TAR, Frictionless Data Package o Bagit. Il formato DOVREBBE essere espresso utilizzando un tipo di supporto come definito dal registro dei tipi di media IANA https://www.iana.org/assignments/media-types/, se disponibili. @it
scope note: Tato vlastnost se použije, když jsou soubory v distribuci zabaleny, např. v souboru TAR, v balíčku Frictionless Data Package nebo v souboru Bagit. Formát BY MĚL být vyjádřen pomocí typu média definovaného v registru IANA https://www.iana.org/assignments/media-types/, pokud existuje. @cs
scope note: This property to be used when the files in the distribution are packaged, e.g. in a TAR file, a Frictionless Data Package or a Bagit file. The format SHOULD be expressed using a media type as defined by IANA media types registry https://www.iana.org/assignments/media-types/, if available.

previous
type: ObjectProperty
sub property of: prev
comment: La risorsa precedente a quella attuale in una collezione ordinata o in una serie di risorse. @it
comment: The previous resource (before the current one) in an ordered collection or series of resources.
label: precedente @it
label: previo @es
change note: New property added in DCAT 3.
change note: Nová vlastnost přidaná ve verzi DCAT 3. @cs
change note: Nueva propiedad agregada in DCAT 3. @es
change note: Nuova proprietà aggiunta in DCAT 3. @it
change note: Ny egenskab tilføjet i DCAT 3. @da
scope note: En DCAT esta propiedad se usa para recursos que pertenecen a una dcat:DatasetSeries. @es
scope note: In DCAT questa proprietà è usata per risorse che fanno parte di una dcat:DatasetSeries. @it
scope note: In DCAT this property is used for resources belonging to a dcat:DatasetSeries.
scope note: It is important to note that this property is different from dcat:previousVersion, as it does not denote a previous version of the same resource, but a distinct resource immediately preceding the current one in an ordered collection of resources.
scope note: È importante notare che questa proprietà è diversa da dcat:previousVersion, dato che non indica una versione precedente della stessa risorsa, ma una risorsa distinta che precede immediatamente quella attuale in una collezione ordinata di risorse. @it

previous version
type: ObjectProperty
sub property of: wasRevisionOf
comment: La versione precedente di una risorsa. @it
comment: The previous version of a resource in a lineage [PAV].
label: versione precedente @it
label: versión anterior @es
change note: New property added in DCAT 3.
change note: Nová vlastnost přidaná ve verzi DCAT 3. @cs
change note: Nueva propiedad agregada in DCAT 3. @es
change note: Nuova proprietà aggiunta in DCAT 3. @it
change note: Ny egenskab tilføjet i DCAT 3. @da
scope note: La nozione di versione usata da questa proprietà è limitata a versioni risultanti da revisioni a cui una risorsa è soggetta nel suo ciclo di vita. Uno dei casi tipici è la rappresentazione della storia delle versioni di un dataset, che sono state pubblicate nel corso del tempo. @it
scope note: Questa proprietà è usata per specificare una catena di versioni, costituita da snapshot di una risorsa. @it
scope note: The notion of version used by this property is limited to versions resulting from revisions occurring to a resource as part of its life-cycle. One of the typical cases here is representing the history of the versions of a dataset that have been released over time.
scope note: This property is meant to be used to specify a version chain, consisting of snapshots of a resource.

qualified relation
type: ObjectProperty
domain: Catalogued resource
range: Relationship
comment: Enlace a una descripción de la relación con otro recurso. @es
comment: Link a una descrizione di una relazione con un'altra risorsa. @it
comment: Link to a description of a relationship with another resource.
comment: Odkaz na popis vztahu s jiným zdrojem. @cs
comment: Reference til en beskrivelse af en relation til en anden ressource. @da
label: Kvalificeret relation @da
label: kvalifikovaný vztah @cs
label: relación calificada @es
label: relazione qualificata @it
change note: New property added in DCAT 2.
change note: Nová vlastnost přidaná ve verzi DCAT 2. @cs
change note: Nuova proprietà aggiunta in DCAT 2. @it
change note: Ny egenskab tilføjet i DCAT 2. @da
change note: Propiedad nueva añadida en DCAT 2. @es
editorial note: Introdotta in DCAT per integrare le altre relazioni qualificate di PROV. @it
editorial note: Introduced into DCAT to complement the other PROV qualified relations.
editorial note: Introduceret i DCAT med henblik på at supplere de øvrige kvalificerede relationer fra PROV. @da
editorial note: Přidáno do DCAT k doplnění jiných kvalifikovaných vztahů ze slovníku PROV. @cs
editorial note: Se incluyó en DCAT para complementar las relaciones calificadas disponibles en PROV. @es
scope note: Anvendes til at referere til en anden ressource hvor relationens betydning er kendt men ikke matcher en af de standardiserede egenskaber fra Dublin Core (dcterms:hasPart, dcterms:isPartOf, dcterms:conformsTo, dcterms:isFormatOf, dcterms:hasFormat, dcterms:isVersionOf, dcterms:hasVersion, dcterms:replaces, dcterms:isReplacedBy, dcterms:references, dcterms:isReferencedBy, dcterms:requires, dcterms:isRequiredBy) eller PROV-O-egenskaber (prov:wasDerivedFrom, prov:wasInfluencedBy, prov:wasQuotedFrom, prov:wasRevisionOf, prov:hadPrimarySource, prov:alternateOf, prov:specializationOf). @da
scope note: Použito pro odkazování na jiný zdroj, kde druh vztahu je znám, ale neodpovídá standardním vlastnostem ze slovníku Dublin Core (dcterms:hasPart, dcterms:isPartOf, dcterms:conformsTo, dcterms:isFormatOf, dcterms:hasFormat, dcterms:isVersionOf, dcterms:hasVersion, dcterms:replaces, dcterms:isReplacedBy, dcterms:references, dcterms:isReferencedBy, dcterms:requires, dcterms:isRequiredBy) či slovníku PROV-O (prov:wasDerivedFrom, prov:wasInfluencedBy, prov:wasQuotedFrom, prov:wasRevisionOf, prov:hadPrimarySource, prov:alternateOf, prov:specializationOf). @cs
scope note: Se usa para asociar con otro recurso para el cuál la naturaleza de la relación es conocida pero no es ninguna de las propiedades que provee el estándar Dublin Core (dcterms:hasPart, dcterms:isPartOf, dcterms:conformsTo, dcterms:isFormatOf, dcterms:hasFormat, dcterms:isVersionOf, dcterms:hasVersion, dcterms:replaces, dcterms:isReplacedBy, dcterms:references, dcterms:isReferencedBy, dcterms:requires, dcterms:isRequiredBy) or PROV-O properties (prov:wasDerivedFrom, prov:wasInfluencedBy, prov:wasQuotedFrom, prov:wasRevisionOf, prov:hadPrimarySource, prov:alternateOf, prov:specializationOf). @es
scope note: Used to link to another resource where the nature of the relationship is known but does not match one of the standard Dublin Core properties (dcterms:hasPart, dcterms:isPartOf, dcterms:conformsTo, dcterms:isFormatOf, dcterms:hasFormat, dcterms:isVersionOf, dcterms:hasVersion, dcterms:replaces, dcterms:isReplacedBy, dcterms:references, dcterms:isReferencedBy, dcterms:requires, dcterms:isRequiredBy) or PROV-O properties (prov:wasDerivedFrom, prov:wasInfluencedBy, prov:wasQuotedFrom, prov:wasRevisionOf, prov:hadPrimarySource, prov:alternateOf, prov:specializationOf).
scope note: Viene utilizzato per associarsi a un'altra risorsa nei casi per i quali la natura della relazione è nota ma non è alcuna delle proprietà fornite dallo standard Dublin Core (dcterms:hasPart, dcterms:isPartOf, dcterms:conformsTo, dcterms:isFormatOf, dcterms:hasFormat , dcterms:isVersionOf, dcterms:hasVersion, dcterms:replaces, dcterms:isReplacedBy, dcterms:references, dcterms:isReferencedBy, dcterms:require, dcterms:isRequiredBy) o dalle proprietà fornite da PROV-O (prov:wasDerivedFrom, prov:wasInfluencedBy, prov:wasQuotedFrom , prov:wasRevisionOf, prov:hadPrimarySource, prov:alternateOf, prov:specializationOf). @it

record
type: ObjectProperty
domain: Catalog
range: Catalog Record
comment: A record describing the registration of a single dataset or data service that is part of the catalog.
comment: Describe la registración de un conjunto de datos o un servicio de datos en el catálogo. @es
comment: En post der beskriver registreringen af et enkelt datasæt eller en datatjeneste som er opført i kataloget. @da
comment: Propojuje katalog a jeho záznamy. @cs
comment: Relie un catalogue à ses registres. @fr
comment: Un record che descrive la registrazione di un singolo set di dati o di un servizio dati che fa parte del catalogo. @it
comment: Záznam popisující registraci jedné datové sady či datové služby jakožto součásti katalogu. @cs
comment: Συνδέει έναν κατάλογο με τις καταγραφές του. @el
comment: تربط الفهرس بسجل ضمنه @ar
comment: カタログの一部であるカタログ・レコード。 @ja
label: post @da
label: registre @fr
label: registro @es
label: záznam @cs
label: καταγραφή @el
label: سجل @ar
label: カタログ・レコード @ja
alternative label: har post @da
editorial note: Status: English, Italian, Spanish and Czech Definitions modified by DCAT revision team, other translations pending.

resource
type: ObjectProperty
sub property of: Has Part
domain: Catalog
range: Catalogued resource
comment: A resource that is listed in the catalog.
comment: Una risorsa elencata nel catalogo. @it
label: risorsa @it
change note: New property added in DCAT 3.
change note: Nová vlastnost přidaná ve verzi DCAT 3. @cs
change note: Nueva propiedad agregada en DCAT 3. @es
change note: Nuova proprietà aggiunta in DCAT 3. @it
editorial note: Status: English Definition text modified by DCAT 3 revision team, translations pending.
scope note: Questo è il predicate più generale per indicare l'appartenenza di una risorsa a un catalogo. Si raccomanda l'uso di una proprietà più specifica, quando disponibile. @it
scope note: See also: Sub-properties of dcat:resource in particular dcat:dataset, dcat:catalog, dcat:service.
scope note: This is the most general predicate for membership of a catalog. Use of a more specific sub-property is recommended when available.
scope note: Vd. anche: Le sottoproprietà di dcat:resource, in particolare: dcat:dataset, dcat:catalog, dcat:service. @it

seriesMember
type: ObjectProperty
inverse of: in series
change note: New property added in DCAT 3.
change note: Nová vlastnost přidaná ve verzi DCAT 3. @cs
change note: Nueva propiedad agregada en DCAT 3. @es
change note: Nuova proprietà aggiunta in DCAT 3. @it
scope note: Esta propiedad inversa PUEDE usarse sólo en combinación con su inversa, y NO PUEDE utilizarse en su reemplazo. @es
scope note: Questa proprietà PUÒ essere usata solo insieme alla sua inversa, e NON DEVE essere usata per sostituirla. @it
scope note: This property MAY be used only in addition to its inverse, and it MUST NOT be used to replace it.

serves dataset
type: ObjectProperty
domain: Data service
range: Dataset
comment: A collection of data that this DataService can distribute.
comment: En samling af data som denne datatjeneste kan distribuere. @da
comment: Kolekce dat, kterou je tato Datová služba schopna poskytnout. @cs
comment: Una colección de datos que este Servicio de Datos puede distribuir. @es
comment: Una raccolta di dati che questo DataService può distribuire. @it
label: datatjeneste for datasæt @da
label: poskytuje datovou sadu @cs
label: provee conjunto de datos @es
label: serve set di dati @it
alternative label: distribuerer @da
alternative label: ekspederer @da
alternative label: udstiller @da
change note: New property in DCAT 2.
change note: Nová vlastnost přidaná ve verzi DCAT 2. @cs
change note: Nueva propiedad agregada en DCAT 2. @es
change note: Nuova proprietà in DCAT 2. @it

service
type: ObjectProperty
sub property of: resource
domain: Catalog
range: Data service
comment: A service that is listed in the catalog.
comment: Et websted eller et endpoint som er opført i kataloget. @da
comment: Umístění či přístupový bod registrovaný v katalogu. @cs
comment: Un sitio o 'endpoint' que está listado en el catálogo. @es
comment: Un sito o endpoint elencato nel catalogo. @it
label: datatjeneste @da
label: servicio @es
label: servizio @it
label: služba @cs
alternative label: har datatjeneste @da
alternative label: has service
change note: New property added in DCAT 2.
change note: Nová vlastnost přidaná ve verzi DCAT 2. @cs
change note: Nueva propiedad añadida en DCAT 2. @es
change note: Nuova proprietà aggiunta in DCAT 2. @it
editorial note: Status: English Definition text modified by DCAT 3 revision team, translations pending.

theme
type: ObjectProperty
sub property of: Subject
comment: A main category of the resource. A resource can have multiple themes.
comment: Et centralt emne for ressourcen. En ressource kan have flere centrale emner. @da
comment: Hlavní téma zdroje. Zdroj může mít více témat. @cs
comment: La categoria principale della risorsa. Una risorsa può avere più temi. @it
comment: La categoría principal del recurso. Un recurso puede tener varios temas. @es
comment: La catégorie principale de la ressource. Une ressource peut avoir plusieurs thèmes. @fr
comment: Η κύρια κατηγορία του συνόλου δεδομένων. Ένα σύνολο δεδομένων δύναται να έχει πολλαπλά θέματα. @el
comment: التصنيف الرئيسي لقائمة البيانات. قائمة البيانات يمكن أن تملك أكثر من تصنيف رئيسي واحد. @ar
comment: データセットの主要カテゴリー。データセットは複数のテーマを持つことができます。 @ja
label: emne @da
label: tema @es
label: thème @fr
label: téma @cs
label: Θέμα @el
label: التصنيف @ar
label: テーマ/カテゴリー @ja
editorial note: Status: English Definition text modified by DCAT revision team, all except for Italian and Czech translations are pending. Scope note has changed and its translations should be updated
scope note: El conjunto de skos:Concepts utilizados para categorizar los recursos están organizados en un skos:ConceptScheme que describe todas las categorías y sus relaciones en el catálogo. @es
scope note: Il set di concetti skos usati per categorizzare le risorse sono organizzati in skos:ConceptScheme che descrive tutte le categorie e le loro relazioni nel catalogo. @it
scope note: Sada instancí třídy skos:Concept použitá pro kategorizaci zdrojů je organizována do schématu konceptů skos:ConceptScheme, které popisuje všechny kategorie v katalogu a jejich vztahy. @cs
scope note: Samlingen af begreber (skos:Concept) der anvendes til at emneinddele ressourcer organiseres i et begrebssystem (skos:ConceptScheme) som beskriver alle emnerne og deres relationer i kataloget. @da
scope note: The set of themes used to categorize the resources are organized in a skos:ConceptScheme, skos:Collection, owl:Ontology or similar, describing all the categories and their relations in the catalog.
scope note: Un ensemble de skos:Concepts utilisés pour catégoriser les ressources sont organisés en un skos:ConceptScheme décrivant toutes les catégories et ses relations dans le catalogue. @fr
scope note: Το σετ των skos:Concepts που χρησιμοποιείται για να κατηγοριοποιήσει τα σύνολα δεδομένων είναι οργανωμένο εντός ενός skos:ConceptScheme που περιγράφει όλες τις κατηγορίες και τις σχέσεις αυτών στον κατάλογο. @el
scope note: データセットを分類するために用いられるskos:Conceptの集合は、カタログのすべてのカテゴリーとそれらの関係を記述しているskos:ConceptSchemeで組織化されます。 @ja

theme taxonomy
type: ObjectProperty
domain: Catalog
range: Resource
range includes: Ontology
range includes: Collection
range includes: Concept Scheme
comment: El sistema de organización del conocimiento utilizado para clasificar conjuntos de datos de catálogos. @es
comment: Il sistema di organizzazione della conoscenza (KOS) usato per classificare i dataset del catalogo. @it
comment: Le systhème d'ogranisation de connaissances utilisé pour classifier les jeux de données du catalogue. @fr
comment: Systém organizace znalostí (KOS) použitý pro klasifikaci datových sad v katalogu. @cs
comment: The knowledge organization system (KOS) used to classify catalog's datasets.
comment: Vidensorganiseringssystem (KOS) som anvendes til at klassificere datasæt i kataloget. @da
comment: Το σύστημα οργάνωσης γνώσης που χρησιμοποιείται για την κατηγοριοποίηση των συνόλων δεδομένων του καταλόγου. @el
comment: لائحة التصنيفات المستخدمه لتصنيف قوائم البيانات ضمن الفهرس @ar
comment: カタログのデータセットを分類するために用いられる知識組織化体系（KOS；knowledge organization system）。 @ja
label: emnetaksonomi @da
label: tassonomia dei temi @it
label: taxonomie de thèmes @fr
label: taxonomie témat @cs
label: taxonomía de temas @es
label: Ταξινομία θεματικών κατηγοριών. @el
label: قائمة التصنيفات @ar
label: テーマ @ja
alternative label: temataksonomi @da
scope note: Det anbefales at taksonomien organiseres i et skos:ConceptScheme, skos:Collection, owl:Ontology eller lignende, som giver mulighed for at ethvert medlem af taksonomien kan forsynes med en IRI og udgives som linked-data. @da
scope note: It is recommended that the taxonomy is organized in a skos:ConceptScheme, skos:Collection, owl:Ontology or similar, which allows each member to be denoted by an IRI and published as linked-data.
scope note: Je doporučeno, aby byla taxonomie vyjádřena jako skos:ConceptScheme, skos:Collection, owl:Ontology nebo podobné, aby mohla být každá položka identifikována pomocí IRI a publikována jako propojená data. @cs
scope note: Se recomienda que la taxonomía se organice como un skos:ConceptScheme, skos:Collection, owl:Ontology o similar, los cuáles permiten que cada miembro se denote con una IRI y se publique como datos enlazados. @es
scope note: Si raccomanda che la tassonomia sia organizzata in uno skos:ConceptScheme, skos:Collection, owl:Ontology o simili, che permette ad ogni membro di essere indicato da un IRI e pubblicato come linked-data. @it

actedOnBehalfOf
type: ObjectProperty
sub property of: wasInfluencedBy
domain: Agent
range: Agent
property chain axiom: qualifiedDelegation
property chain axiom: agent
comment: An object property to express the accountability of an agent towards another agent. The subordinate agent acted on behalf of the responsible agent in an actual activity.
category: starting-point
component: agents-responsibility
inverse: hadDelegate
qualified form: Delegation
qualified form: qualifiedDelegation

activity
type: ObjectProperty
sub property of: influencer
domain: ActivityInfluence
range: Activity
category: qualified
editorial note: This property behaves in spirit like rdf:object; it references the object of a prov:wasInfluencedBy triple.
editors definition: The prov:activity property references an prov:Activity which influenced a resource. This property applies to an prov:ActivityInfluence, which is given by a subproperty of prov:qualifiedInfluence from the influenced prov:Entity, prov:Activity or prov:Agent.
inverse: activityOfInfluence

agent
type: ObjectProperty
sub property of: influencer
domain: AgentInfluence
range: Agent
category: qualified
editorial note: This property behaves in spirit like rdf:object; it references the object of a prov:wasInfluencedBy triple.
editors definition: The prov:agent property references an prov:Agent which influenced a resource. This property applies to an prov:AgentInfluence, which is given by a subproperty of prov:qualifiedInfluence from the influenced prov:Entity, prov:Activity or prov:Agent.
inverse: agentOfInfluence

alternateOf
type: ObjectProperty
domain: Entity
range: Entity
category: expanded
component: alternate
constraints: http://www.w3.org/TR/2013/REC-prov-constraints-20130430/#prov-dm-constraints-fig
definition: Two alternate entities present aspects of the same thing. These aspects may be the same or different, and the alternate entities may or may not overlap in time.
dm: http://www.w3.org/TR/2013/REC-prov-dm-20130430/#term-alternate
inverse: alternateOf
n: http://www.w3.org/TR/2013/REC-prov-n-20130430/#expression-alternate

atLocation
type: ObjectProperty
domain: Class
  union of: Activity
  union of: Agent
  union of: Entity
  union of: InstantaneousEvent
range: Location
comment: The Location of any resource.
comment: This property has multiple RDFS domains to suit multiple OWL Profiles. See PROV-O OWL Profile.
category: expanded
editorial note: The naming of prov:atLocation parallels prov:atTime, and is not named prov:hadLocation to avoid conflicting with the convention that prov:had* properties are used on prov:Influence classes.
editorial note: This property is not functional because the many values could be at a variety of granularies (In this building, in this room, in that chair).
inverse: locationOf
shares definition with: Location

entity
type: ObjectProperty
sub property of: influencer
domain: EntityInfluence
range: Entity
category: qualified
editorial note: This property behaves in spirit like rdf:object; it references the object of a prov:wasInfluencedBy triple.
editors definition: The prov:entity property references an prov:Entity which influenced a resource. This property applies to an prov:EntityInfluence, which is given by a subproperty of prov:qualifiedInfluence from the influenced prov:Entity, prov:Activity or prov:Agent.
inverse: entityOfInfluence

generated
type: ObjectProperty
sub property of: influenced
inverse of: wasGeneratedBy
domain: Activity
range: Entity
category: expanded
component: entities-activities
editorial note: prov:generated is one of few inverse property defined, to allow Activity-oriented assertions in addition to Entity-oriented assertions.
inverse: wasGeneratedBy
shares definition with: Generation

hadActivity
type: ObjectProperty
domain: Influence
domain: Class
  union of: Delegation
  union of: Derivation
  union of: End
  union of: Start
range: Activity
comment: The _optional_ Activity of an Influence, which used, generated, invalidated, or was the responsibility of some Entity. This property is _not_ used by ActivityInfluence (use prov:activity instead).
comment: This property has multiple RDFS domains to suit multiple OWL Profiles. See PROV-O OWL Profile.
category: qualified
component: derivations
editorial note: The multiple rdfs:domain assertions are intended. One is simpler and works for OWL-RL, the union is more specific but is not recognized by OWL-RL.
inverse: wasActivityOfInfluence
shares definition with: Activity

hadGeneration
type: ObjectProperty
domain: Derivation
range: Generation
comment: The _optional_ Generation involved in an Entity's Derivation.
category: qualified
component: derivations
inverse: generatedAsDerivation
shares definition with: Generation

hadMember
type: ObjectProperty
sub property of: wasInfluencedBy
domain: Collection
range: Entity
category: expanded
component: expanded
inverse: wasMemberOf
shares definition with: Collection

Axiom
annotated source: hadMember
annotated property: range
annotated target: Entity
comment: A collection is an entity that provides a structure to some constituents, which are themselves entities. These constituents are said to be member of the collections.
dm: http://www.w3.org/TR/2013/REC-prov-dm-20130430/#term-collection

hadPlan
type: ObjectProperty
domain: Association
range: Plan
comment: The _optional_ Plan adopted by an Agent in Association with some Activity. Plan specifications are out of the scope of this specification.
category: qualified
component: agents-responsibility
inverse: wasPlanOf
shares definition with: Plan

hadPrimarySource
type: ObjectProperty
sub property of: wasDerivedFrom
domain: Entity
range: Entity
property chain axiom: qualifiedPrimarySource
property chain axiom: entity
category: expanded
component: derivations
inverse: wasPrimarySourceOf
qualified form: PrimarySource
qualified form: qualifiedPrimarySource

Axiom
annotated source: hadPrimarySource
annotated property: subPropertyOf
annotated target: wasDerivedFrom
comment: hadPrimarySource property is a particular case of wasDerivedFrom (see http://www.w3.org/TR/prov-dm/#term-original-source) that aims to give credit to the source that originated some information.

hadRole
type: ObjectProperty
domain: Influence
domain: Class
  union of: Association
  union of: InstantaneousEvent
range: Role
comment: The _optional_ Role that an Entity assumed in the context of an Activity. For example, :baking prov:used :spoon; prov:qualified [ a prov:Usage; prov:entity :spoon; prov:hadRole roles:mixing_implement ].
comment: This property has multiple RDFS domains to suit multiple OWL Profiles. See PROV-O OWL Profile.
category: qualified
component: agents-responsibility
editors definition: prov:hadRole references the Role (i.e. the function of an entity with respect to an activity), in the context of an instantaneous usage, generation, association, start, and end.
inverse: wasRoleIn
shares definition with: Role

hadUsage
type: ObjectProperty
domain: Derivation
range: Usage
comment: The _optional_ Usage involved in an Entity's Derivation.
category: qualified
component: derivations
inverse: wasUsedInDerivation
shares definition with: Usage

influenced
type: ObjectProperty
inverse of: wasInfluencedBy
category: expanded
component: agents-responsibility
inverse: wasInfluencedBy
shares definition with: Influence

influencer
type: ObjectProperty
domain: Influence
range: Thing
comment: Subproperties of prov:influencer are used to cite the object of an unqualified PROV-O triple whose predicate is a subproperty of prov:wasInfluencedBy (e.g. prov:used, prov:wasGeneratedBy). prov:influencer is used much like rdf:object is used.
category: qualified
dm: http://www.w3.org/TR/2013/REC-prov-dm-20130430/#term-influence
editorial note: This property and its subproperties are used in the same way as the rdf:object property, i.e. to reference the object of an unqualified prov:wasInfluencedBy or prov:influenced triple.
editors definition: This property is used as part of the qualified influence pattern. Subclasses of prov:Influence use these subproperties to reference the resource (Entity, Agent, or Activity) whose influence is being qualified.
inverse: hadInfluence

invalidated
type: ObjectProperty
sub property of: influenced
inverse of: wasInvalidatedBy
domain: Activity
range: Entity
category: expanded
component: entities-activities
editorial note: prov:invalidated is one of few inverse property defined, to allow Activity-oriented assertions in addition to Entity-oriented assertions.
inverse: wasInvalidatedBy
shares definition with: Invalidation

qualifiedAssociation
type: ObjectProperty
sub property of: qualifiedInfluence
domain: Activity
range: Association
comment: If this Activity prov:wasAssociatedWith Agent :ag, then it can qualify the Association using prov:qualifiedAssociation [ a prov:Association; prov:agent :ag; :foo :bar ].
category: qualified
component: agents-responsibility
inverse: qualifiedAssociationOf
shares definition with: Association
unqualified form: wasAssociatedWith

qualifiedAttribution
type: ObjectProperty
sub property of: qualifiedInfluence
domain: Entity
range: Attribution
comment: If this Entity prov:wasAttributedTo Agent :ag, then it can qualify how it was influenced using prov:qualifiedAttribution [ a prov:Attribution; prov:agent :ag; :foo :bar ].
category: qualified
component: agents-responsibility
inverse: qualifiedAttributionOf
shares definition with: Attribution
unqualified form: wasAttributedTo

qualifiedCommunication
type: ObjectProperty
sub property of: qualifiedInfluence
domain: Activity
range: Communication
comment: If this Activity prov:wasInformedBy Activity :a, then it can qualify how it was influenced using prov:qualifiedCommunication [ a prov:Communication; prov:activity :a; :foo :bar ].
category: qualified
component: entities-activities
inverse: qualifiedCommunicationOf
qualified form: Communication
shares definition with: Communication

qualifiedDelegation
type: ObjectProperty
sub property of: qualifiedInfluence
domain: Agent
range: Delegation
comment: If this Agent prov:actedOnBehalfOf Agent :ag, then it can qualify how with prov:qualifiedResponsibility [ a prov:Responsibility; prov:agent :ag; :foo :bar ].
category: qualified
component: agents-responsibility
inverse: qualifiedDelegationOf
shares definition with: Delegation
unqualified form: actedOnBehalfOf

qualifiedDerivation
type: ObjectProperty
sub property of: qualifiedInfluence
domain: Entity
range: Derivation
comment: If this Entity prov:wasDerivedFrom Entity :e, then it can qualify how it was derived using prov:qualifiedDerivation [ a prov:Derivation; prov:entity :e; :foo :bar ].
category: qualified
component: derivations
inverse: qualifiedDerivationOf
shares definition with: Derivation
unqualified form: wasDerivedFrom

qualifiedEnd
type: ObjectProperty
sub property of: qualifiedInfluence
domain: Activity
range: End
comment: If this Activity prov:wasEndedBy Entity :e1, then it can qualify how it was ended using prov:qualifiedEnd [ a prov:End; prov:entity :e1; :foo :bar ].
category: qualified
component: entities-activities
inverse: qualifiedEndOf
shares definition with: End
unqualified form: wasEndedBy

qualifiedGeneration
type: ObjectProperty
sub property of: qualifiedInfluence
domain: Entity
range: Generation
comment: If this Activity prov:generated Entity :e, then it can qualify how it performed the Generation using prov:qualifiedGeneration [ a prov:Generation; prov:entity :e; :foo :bar ].
category: qualified
component: entities-activities
inverse: qualifiedGenerationOf
shares definition with: Generation
unqualified form: wasGeneratedBy

qualifiedInfluence
type: ObjectProperty
domain: Class
  union of: Activity
  union of: Agent
  union of: Entity
range: Influence
comment: Because prov:qualifiedInfluence is a broad relation, the more specific relations (qualifiedCommunication, qualifiedDelegation, qualifiedEnd, etc.) should be used when applicable.
category: qualified
component: derivations
inverse: qualifiedInfluenceOf
shares definition with: Influence
unqualified form: wasInfluencedBy

qualifiedInvalidation
type: ObjectProperty
sub property of: qualifiedInfluence
domain: Entity
range: Invalidation
comment: If this Entity prov:wasInvalidatedBy Activity :a, then it can qualify how it was invalidated using prov:qualifiedInvalidation [ a prov:Invalidation; prov:activity :a; :foo :bar ].
category: qualified
component: entities-activities
inverse: qualifiedInvalidationOf
shares definition with: Invalidation
unqualified form: wasInvalidatedBy

qualifiedPrimarySource
type: ObjectProperty
sub property of: qualifiedInfluence
domain: Entity
range: PrimarySource
comment: If this Entity prov:hadPrimarySource Entity :e, then it can qualify how using prov:qualifiedPrimarySource [ a prov:PrimarySource; prov:entity :e; :foo :bar ].
category: qualified
component: derivations
inverse: qualifiedSourceOf
shares definition with: PrimarySource
unqualified form: hadPrimarySource

qualifiedQuotation
type: ObjectProperty
sub property of: qualifiedInfluence
domain: Entity
range: Quotation
comment: If this Entity prov:wasQuotedFrom Entity :e, then it can qualify how using prov:qualifiedQuotation [ a prov:Quotation; prov:entity :e; :foo :bar ].
category: qualified
component: derivations
inverse: qualifiedQuotationOf
shares definition with: Quotation
unqualified form: wasQuotedFrom

qualifiedRevision
type: ObjectProperty
sub property of: qualifiedInfluence
domain: Entity
range: Revision
comment: If this Entity prov:wasRevisionOf Entity :e, then it can qualify how it was revised using prov:qualifiedRevision [ a prov:Revision; prov:entity :e; :foo :bar ].
category: qualified
component: derivations
inverse: revisedEntity
shares definition with: Revision
unqualified form: wasRevisionOf

qualifiedStart
type: ObjectProperty
sub property of: qualifiedInfluence
domain: Activity
range: Start
comment: If this Activity prov:wasStartedBy Entity :e1, then it can qualify how it was started using prov:qualifiedStart [ a prov:Start; prov:entity :e1; :foo :bar ].
category: qualified
component: entities-activities
inverse: qualifiedStartOf
shares definition with: Start
unqualified form: wasStartedBy

qualifiedUsage
type: ObjectProperty
sub property of: qualifiedInfluence
domain: Activity
range: Usage
comment: If this Activity prov:used Entity :e, then it can qualify how it used it using prov:qualifiedUsage [ a prov:Usage; prov:entity :e; :foo :bar ].
category: qualified
component: entities-activities
inverse: qualifiedUsingActivity
shares definition with: Usage
unqualified form: used

used
type: ObjectProperty
sub property of: wasInfluencedBy
domain: Activity
range: Entity
property chain axiom: qualifiedUsage
property chain axiom: entity
comment: A prov:Entity that was used by this prov:Activity. For example, :baking prov:used :spoon, :egg, :oven .
category: starting-point
component: entities-activities
inverse: wasUsedBy
qualified form: Usage
qualified form: qualifiedUsage

wasAssociatedWith
type: ObjectProperty
sub property of: wasInfluencedBy
domain: Activity
range: Agent
property chain axiom: qualifiedAssociation
property chain axiom: agent
comment: An prov:Agent that had some (unspecified) responsibility for the occurrence of this prov:Activity.
category: starting-point
component: agents-responsibility
inverse: wasAssociateFor
qualified form: Association
qualified form: qualifiedAssociation

wasAttributedTo
type: ObjectProperty
sub property of: wasInfluencedBy
domain: Entity
range: Agent
property chain axiom: qualifiedAttribution
property chain axiom: agent
comment: Attribution is the ascribing of an entity to an agent.
category: starting-point
component: agents-responsibility
definition: Attribution is the ascribing of an entity to an agent.
inverse: contributed
qualified form: Attribution
qualified form: qualifiedAttribution

Axiom
annotated source: wasAttributedTo
annotated property: subPropertyOf
annotated target: wasInfluencedBy
comment: Attribution is a particular case of trace (see http://www.w3.org/TR/prov-dm/#concept-trace), in the sense that it links an entity to the agent that ascribed it.
definition: IF wasAttributedTo(e2,ag1,aAttr) holds, THEN wasInfluencedBy(e2,ag1) also holds.

wasDerivedFrom
type: ObjectProperty
sub property of: wasInfluencedBy
domain: Entity
range: Entity
property chain axiom: qualifiedDerivation
property chain axiom: entity
comment: The more specific subproperties of prov:wasDerivedFrom (i.e., prov:wasQuotedFrom, prov:wasRevisionOf, prov:hadPrimarySource) should be used when applicable.
category: starting-point
component: derivations
definition: A derivation is a transformation of an entity into another, an update of an entity resulting in a new one, or the construction of a new entity based on a pre-existing entity.
inverse: hadDerivation
qualified form: Derivation
qualified form: qualifiedDerivation

Axiom
annotated source: wasDerivedFrom
annotated property: subPropertyOf
annotated target: wasInfluencedBy
comment: Derivation is a particular case of trace (see http://www.w3.org/TR/prov-dm/#term-trace), since it links an entity to another entity that contributed to its existence.

wasEndedBy
type: ObjectProperty
sub property of: wasInfluencedBy
domain: Activity
range: Entity
property chain axiom: qualifiedEnd
property chain axiom: entity
comment: End is when an activity is deemed to have ended. An end may refer to an entity, known as trigger, that terminated the activity.
category: expanded
component: entities-activities
inverse: ended
qualified form: End
qualified form: qualifiedEnd

wasGeneratedBy
type: ObjectProperty
sub property of: wasInfluencedBy
domain: Entity
range: Activity
property chain axiom: qualifiedGeneration
property chain axiom: activity
category: starting-point
component: entities-activities
inverse: generated
qualified form: Generation
qualified form: qualifiedGeneration

wasInfluencedBy
type: ObjectProperty
domain: Class
range: Class
comment: Because prov:wasInfluencedBy is a broad relation, its more specific subproperties (e.g. prov:wasInformedBy, prov:actedOnBehalfOf, prov:wasEndedBy, etc.) should be used when applicable.
comment: This property has multiple RDFS domains to suit multiple OWL Profiles. See PROV-O OWL Profile.
category: qualified
component: agents-responsibility
editorial note: The sub-properties of prov:wasInfluencedBy can be elaborated in more detail using the Qualification Pattern. For example, the binary relation :baking prov:used :spoon can be qualified by asserting :baking prov:qualifiedUsage [ a prov:Usage; prov:entity :spoon; prov:atLocation :kitchen ] . Subproperties of prov:wasInfluencedBy may also be asserted directly without being qualified. prov:wasInfluencedBy should not be used without also using one of its subproperties.
inverse: influenced
qualified form: Influence
qualified form: qualifiedInfluence
shares definition with: Influence

Axiom
annotated source: wasInfluencedBy
annotated property: domain
annotated target: Class
definition: influencee: an identifier (o2) for an entity, activity, or agent;
dm: http://www.w3.org/TR/2013/REC-prov-dm-20130430/#term-influence

Axiom
annotated source: wasInfluencedBy
annotated property: range
annotated target: Class
definition: influencer: an identifier (o1) for an ancestor entity, activity, or agent that the former depends on;
dm: http://www.w3.org/TR/2013/REC-prov-dm-20130430/#term-influence

wasInformedBy
type: ObjectProperty
sub property of: wasInfluencedBy
domain: Activity
range: Activity
property chain axiom: qualifiedCommunication
property chain axiom: activity
comment: An activity a2 is dependent on or informed by another activity a1, by way of some unspecified entity that is generated by a1 and used by a2.
category: starting-point
component: entities-activities
inverse: informed
qualified form: Communication
qualified form: qualifiedCommunication

wasInvalidatedBy
type: ObjectProperty
sub property of: wasInfluencedBy
domain: Entity
range: Activity
property chain axiom: qualifiedInvalidation
property chain axiom: activity
category: expanded
component: entities-activities
inverse: invalidated
qualified form: Invalidation
qualified form: qualifiedInvalidation

wasQuotedFrom
type: ObjectProperty
sub property of: wasDerivedFrom
domain: Entity
range: Entity
property chain axiom: qualifiedQuotation
property chain axiom: entity
comment: An entity is derived from an original entity by copying, or 'quoting', some or all of it.
category: expanded
component: derivations
inverse: quotedAs
qualified form: Quotation
qualified form: qualifiedQuotation

Axiom
annotated source: wasQuotedFrom
annotated property: subPropertyOf
annotated target: wasDerivedFrom
comment: Quotation is a particular case of derivation (see http://www.w3.org/TR/prov-dm/#term-quotation) in which an entity is derived from an original entity by copying, or "quoting", some or all of it.

Axiom
annotated source: wasRevisionOf
annotated property: subPropertyOf
annotated target: wasDerivedFrom
comment: Revision is a derivation (see http://www.w3.org/TR/prov-dm/#term-Revision). Moreover, according to http://www.w3.org/TR/2013/REC-prov-constraints-20130430/#term-Revision 23 April 2012 'wasRevisionOf is a strict sub-relation of wasDerivedFrom since two entities e2 and e1 may satisfy wasDerivedFrom(e2,e1) without being a variant of each other.'

wasStartedBy
type: ObjectProperty
sub property of: wasInfluencedBy
domain: Activity
range: Entity
property chain axiom: qualifiedStart
property chain axiom: entity
comment: Start is when an activity is deemed to have started. A start may refer to an entity, known as trigger, that initiated the activity.
category: expanded
component: entities-activities
inverse: started
qualified form: Start
qualified form: qualifiedStart

homepage
type: ObjectProperty
comment: Este axioma se necesita de manera que Protege cargue DCAT3 sin problemas. @es
comment: This axiom needed so that Protege loads DCAT 3 without errors.

primaryTopic
type: ObjectProperty
comment: Este axioma se necesita de manera que Protege cargue DCAT 3 sin problemas. @es
comment: This axiom needed so that Protege loads DCAT 3 without errors.

active
type: DatatypeProperty
domain: Dataset
range: boolean
comment: boolean to define if the dataAsset is ready to be visible.

address
type: DatatypeProperty
domain: Organization
range: Literal
comment: address

analyzing
type: DatatypeProperty
domain: LicenseGrant
range: boolean
comment: analyzing

consumerDescription
type: DatatypeProperty
domain: Consumer
range: Literal
comment: consumer Description.

consumerId
type: DatatypeProperty
domain: Consumer
range: Literal
comment: IDentifier on a BIG-IoT Sourceplace of a consumer.

consumerName
type: DatatypeProperty
domain: Consumer
range: Literal
comment: consumer Name.

DataSourceDescription
type: DatatypeProperty
domain: DataSource
range: Literal
comment: Data Sourceplace Description.

DataSourceName
type: DatatypeProperty
domain: DataSource
range: Literal
comment: Data Sourceplace Name.

dataStream
type: DatatypeProperty
domain: Distribuce
range: boolean
comment: Boolean attribute to check if the dataset is offered as stream or not

datasetDescription
type: DatatypeProperty
domain: Dataset
range: Literal
comment: Data Asset Description.

datasetID
type: DatatypeProperty
domain: Dataset
range: Literal
comment: dataAsset identifier.

datasetLabel
type: DatatypeProperty
domain: Dataset
range: Literal
comment: Data Asset Label

datasetTitle
type: DatatypeProperty
domain: Dataset
range: Literal
comment: Data Asset Title

distributing
type: DatatypeProperty
domain: LicenseGrant
range: boolean
comment: distributing

editData
type: DatatypeProperty
domain: IntendedUse
range: boolean
comment: editData

exclusiveness
type: DatatypeProperty
domain: LicenseGrant
range: boolean
comment: exclusiveness

furtherLicensing
type: DatatypeProperty
domain: LicenseGrant
range: boolean
comment: furtherLicensing

hasGoverningJurisdiction
type: DatatypeProperty
domain: ContractParameters
range: Literal
comment: hasGoverningJurisdiction

inNode
type: DatatypeProperty
domain: Dataset
range: Literal
comment: Identify the Node of the originated Source dataAsset Actor in the network.

inSharedNetwork
type: DatatypeProperty
domain: Dataset
range: boolean
comment: boolean to define if the dataAsset is shared by tohsa to be visible and consumable by all actors in the TOHSA Network.

interestDescription
type: DatatypeProperty
domain: ContractParameters
range: Literal
comment: Data provider can specify which sort of quotation he wants exactly, e.g., quotation for maintenance service or quotation for optimization of production

interestOfProvider
type: DatatypeProperty
domain: ContractParameters
range: Literal
comment: This property is used to identify the interest of the data owner. The following possibilities exist: - Free Sharing -Quotation -Selling of data (e.g. just earning money by selling the data, no specific feedback on these data by a data consumer expected)

leasing
type: DatatypeProperty
domain: LicenseGrant
range: boolean
comment: leasing

loaning
type: DatatypeProperty
domain: LicenseGrant
range: boolean
comment: loaning

modifying
type: DatatypeProperty
domain: LicenseGrant
range: boolean
comment: modifying

organizationDescription
type: DatatypeProperty
domain: Organization
range: Literal
comment: organizationDescription

organizationID
type: DatatypeProperty
domain: Organization
range: Literal
comment: organizationId identifier.

organizationName
type: DatatypeProperty
domain: Organization
range: Literal
comment: organizationName

ownerConsentForm
type: DatatypeProperty
domain: Dataset
range: boolean
comment: Hashtag string to report the information about the explicit user consent form documentations.

ownerescription
type: DatatypeProperty
domain: Owner
range: Literal
comment: owner Description.

ownerId
type: DatatypeProperty
domain: Owner
range: Literal
comment: ownerId identifier.

ownerName
type: DatatypeProperty
domain: Owner
range: Literal
comment: owner Name.

paidUp
type: DatatypeProperty
domain: LicenseGrant
range: boolean
comment: paidUp

personalData
type: DatatypeProperty
domain: Dataset
range: boolean
comment: To define if the Data Asset offer dataset that contain personal data

processData
type: DatatypeProperty
domain: IntendedUse
range: boolean
comment: processData

processing
type: DatatypeProperty
domain: LicenseGrant
range: boolean
comment: processing

providerDescription
type: DatatypeProperty
domain: Provider
range: Literal
comment: Provider Description.

providerId
type: DatatypeProperty
domain: Provider
range: Literal
comment: Provider identifier.

ProviderName
type: DatatypeProperty
domain: Provider
range: Literal
comment: Provider Name.

purpose
type: DatatypeProperty
domain: ContractParameters
range: Literal
comment: purpose

ContractPurposeDescriptio
type: DatatypeProperty
domain: ContractParameters
range: Literal
comment: ContractPurposeDescriptio

queryId
type: DatatypeProperty
domain: datasetQuery
range: Literal
comment: dataAsset query identifier.

queryName
type: DatatypeProperty
domain: datasetQuery
range: Literal
comment: dataAsset query name.

renting
type: DatatypeProperty
domain: LicenseGrant
range: boolean
comment: renting

reproducing
type: DatatypeProperty
domain: LicenseGrant
range: boolean
comment: reproducing

revocable
type: DatatypeProperty
domain: LicenseGrant
range: boolean
comment: revocable

selling
type: DatatypeProperty
domain: LicenseGrant
range: boolean
comment: selling

serviceId
type: DatatypeProperty
domain: Data service
range: Literal
comment: service Id

shareDataWithThirdParty
type: DatatypeProperty
domain: IntendedUse
range: boolean
comment: shareDataWithThirdParty

SourceId
type: DatatypeProperty
domain: DataSource
range: Literal
comment: Data Source identifier.

status
type: DatatypeProperty
domain: Dataset
range: Literal
comment: An dataAsset status Possible values:Active: The offer is active and visible to everyone. Inactive: The offer is not visible, but still exists and can be activated again. ToBeDeleted: Data offer is still available and visible, but will be deleted once the last contract on this offer expired. No new purchases allowed on it. Deleted: The offer is not visible and cannot be activated again. No longer available for consumers or providers.

storingCopy
type: DatatypeProperty
domain: LicenseGrant
range: boolean
comment: storingCopy

storingData
type: DatatypeProperty
domain: LicenseGrant
range: boolean
comment: storingData

subscriptionID
type: DatatypeProperty
domain: datasetSubscription
range: Literal
comment: Subscription identifier.

transferable
type: DatatypeProperty
domain: LicenseGrant
range: boolean
comment: transferable

notation
type: DatatypeProperty
definition: A notation, also known as classification code, is a string of characters such as "T58.5" or "303.4833" used to uniquely identify a concept within the scope of a given concept scheme.
scope note: By convention, skos:notation is used with a typed literal in the object position of the triple.

bounding box
type: DatatypeProperty
domain: Location
range: Literal
comment: Den geografiske omskrevne firkant af en ressource. @da
comment: El cuadro delimitador geográfico para un recurso. @es
comment: Il riquadro di delimitazione geografica di una risorsa. @it
comment: Ohraničení geografické oblasti zdroje. @cs
comment: The geographic bounding box of a spatial thing [SDW-BP].
label: cuadro delimitador @es
label: ohraničení oblasti @cs
label: quadro di delimitazione @it
change note: New property added in DCAT 2.
change note: Nová vlastnost přidaná ve verzi DCAT 2. @cs
change note: Nuova proprietà aggiunta in DCAT 2. @it
change note: Ny egenskab tilføjet i DCAT 2. @da
change note: Propiedad nueva agregada en DCAT 2. @es
editorial note: English language definitions and comments updated in this revision in line with ED. Multilingual text unevenly updated.
scope note: El rango de esta propiedad es intencionalmente genérico con el propósito de permitir distintas codificaciones geométricas. Por ejemplo, la geometría puede ser codificada como WKT (geosparql:wktLiteral [GeoSPARQL]) o [GML] (geosparql:asGML [GeoSPARQL]). @es
scope note: Il range di questa proprietà (rdfs:Literal) è volutamente generica, con lo scopo di consentire diverse codifiche geometriche letterali. Ad esempio, la geometria potrebbe essere codificata con un letterale WKT (geosparql:wktLiteral [GeoSPARQL]) o [GML] (geosparql:asGML [GeoSPARQL]). @it
scope note: Obor hodnot této vlastnosti je úmyslně obecný, aby umožnil různé kódování geometrií. Geometrie by kupříkladu mohla být kódována jako WKT (geosparql:wktLiteral [GeoSPARQL]) či [GML] (geosparql:asGML [GeoSPARQL]). @cs
scope note: Rækkevidden for denne egenskab er bevidst generisk defineret med det formål at tillade forskellige kodninger af geometrier. Geometrien kan eksempelvis repræsenteres som WKT (geosparql:asWKT [GeoSPARQL]) eller [GML] (geosparql:asGML [GeoSPARQL]). @da
scope note: The range of this property (rdfs:Literal) is intentionally generic, with the purpose of allowing different geometry literal encodings. E.g., the geometry could be encoded as a WKT literal (geosparql:wktLiteral [GeoSPARQL]).

byte size
type: DatatypeProperty
domain: Distribuce
range: Literal
comment: El tamaño de una distribución en bytes. @es
comment: La dimensione di una distribuzione in byte. @it
comment: La taille de la distribution en octects @fr
comment: Størrelsen af en distributionen angivet i bytes. @da
comment: The size of a distribution in bytes.
comment: Velikost distribuce v bajtech. @cs
comment: Το μέγεθος μιας διανομής σε bytes. @el
comment: الحجم بالبايتات @ar
comment: バイトによる配信のサイズ。 @ja
label: bytestørrelse @da
label: dimensione in byte @it
label: taille en octects @fr
label: tamaño en bytes @es
label: velikost v bajtech @cs
label: μέγεθος σε bytes @el
label: الحجم بالبايت @ar
label: バイト・サイズ @ja
definition: La taille de la distribution en octects. @fr
definition: Størrelsen af en distribution angivet i bytes. @da
scope note: Bytestørrelsen kan approximeres hvis den præcise størrelse ikke er kendt. Værdien af dcat:byteSize bør angives som xsd:decimal. @da
scope note: El tamaño en bytes puede ser aproximado cuando se desconoce el tamaño exacto. El valor literal de dcat:byteSize debe tener tipo 'xsd:decimal'. @es
scope note: La dimensione in byte può essere approssimata quando non si conosce la dimensione precisa. Il valore di dcat:byteSize dovrebbe essere espresso come un xsd:decimal. @it
scope note: La taille en octects peut être approximative lorsque l'on ignore la taille réelle. La valeur littérale de dcat:byteSize doit être de type xsd:decimal. @fr
scope note: The size in bytes can be approximated when the precise size is not known. The literal value of dcat:byteSize should by typed as xsd:decimal.
scope note: Velikost v bajtech může být přibližná, pokud její přesná hodnota není známa. Literál s hodnotou dcat:byteSize by měl mít datový typ xsd:decimal. @cs
scope note: Το μέγεθος σε bytes μπορεί να προσεγγιστεί όταν η ακριβής τιμή δεν είναι γνωστή. Η τιμή της dcat:byteSize θα πρέπει να δίνεται με τύπο δεδομένων xsd:decimal. @el
scope note: الحجم يمكن أن يكون تقريبي إذا كان الحجم الدقيق غير معروف @ar
scope note: 正確なサイズが不明である場合、サイズは、バイトによる近似値を示すことができます。 @ja

centroid
type: DatatypeProperty
domain: Location
range: Literal
comment: Det geometrisk tyngdepunkt (centroid) for en ressource. @da
comment: El centro geográfico (centroide) de un recurso. @es
comment: Geografický střed (centroid) zdroje. @cs
comment: Il centro geografico (centroide) di una risorsa. @it
comment: The geographic center (centroid) of a spatial thing [SDW-BP].
label: centroide @es
label: geometrisk tyngdepunkt @da
change note: New property added in DCAT 2.
change note: Nová vlastnost přidaná ve verzi DCAT 2. @cs
change note: Nueva propiedad agregada en DCAT 2. @es
change note: Nuova proprietà aggiunta in DCAT 2. @it
change note: Ny egenskab tilføjet i DCAT 2. @da
editorial note: English language definitions and comments updated in this revision in line with ED. Multilingual text unevenly updated.
scope note: El rango de esta propiedad es intencionalmente genérico con el objetivo de permitir distintas codificaciones geométricas. Por ejemplo, la geometría puede codificarse como WKT (geosparql:wktLiteral [GeoSPARQL]) o [GML] (geosparql:asGML [GeoSPARQL]). @es
scope note: Il range di questa proprietà (rdfs:Literal) è volutamente generica, con lo scopo di consentire diverse codifiche geometriche letterali. Ad esempio, la geometria potrebbe essere codificata con un letterale WKT (geosparql:wktLiteral [GeoSPARQL]) o [GML] (geosparql:asGML [GeoSPARQL]). @it
scope note: Obor hodnot této vlastnosti je úmyslně obecný, aby umožnil různé kódování geometrií. Geometrie by kupříkladu mohla být kódována jako WKT (geosparql:wktLiteral [GeoSPARQL]) či [GML] (geosparql:asGML [GeoSPARQL]). @cs
scope note: Rækkevidden for denne egenskab er bevidst generisk definere med det formål at tillade forskellige geokodninger. Geometrien kan eksempelvis repræsenteres som WKT (geosparql:asWKT [GeoSPARQL]) eller [GML] (geosparql:asGML [GeoSPARQL]). @da
scope note: The range of this property (rdfs:Literal) is intentionally generic, with the purpose of allowing different geometry literal encodings. E.g., the geometry could be encoded as a WKT literal (geosparql:wktLiteral [GeoSPARQL]).

end date
type: DatatypeProperty
domain: Period of Time
range: Literal
comment: El fin del período. @es
comment: Konec doby trvání. @cs
comment: La fine del periodo. @it
comment: Slutningen på perioden. @da
comment: The end of the period.
label: data di fine @it
label: datum konce @cs
label: fecha final @es
label: slutdato @da
alternative label: sluttidspunkt @da
change note: New property added in DCAT 2.
change note: Nová vlastnost přidaná ve verzi DCAT 2. @cs
change note: Nueva propiedad agregada en DCAT 2. @es
change note: Nuova proprietà aggiunta in DCAT 2. @it
change note: Ny egenskab i DCAT 2. @da
scope note: El rango de esta propiedad es intencionalmente genérico con el propósito de permitir distintos niveles de precisión temporal para especificar el fin del período. Por ejemplo, puede expresarse como una fecha (xsd:date), una fecha y un tiempo (xsd:dateTime), o un año (xsd:gYear). @es
scope note: La range di questa proprietà è volutamente generico, con lo scopo di consentire diversi livelli di precisione temporale per specificare la fine di un periodo. Ad esempio, può essere espresso con una data (xsd:date), una data e un'ora (xsd:dateTime), o un anno (xsd:gYear). @it
scope note: Obor hodnot této vlastnosti je úmyslně obecný, aby umožnil různé úrovně časového rozlišení pro specifikaci konce doby trvání. Ten může být kupříkladu vyjádřen datumem (xsd:date), datumem a časem (xsd:dateTime) či rokem (xsd:gYear). @cs
scope note: Rækkeviden for denne egenskab er bevidst generisk defineret med det formål at tillade forskellige niveauer af tidslig præcision ifm. angivelse af slutdatoen for en periode. Den kan eksempelvis udtrykkes som en dato (xsd:date), en dato og et tidspunkt (xsd:dateTime), eller et årstal (xsd:gYear). @da
scope note: The range of this property is intentionally generic, with the purpose of allowing different level of temporal precision for specifying the end of a period. E.g., it can be expressed with a date (xsd:date), a date and time (xsd:dateTime), or a year (xsd:gYear).

keyword
type: DatatypeProperty
range: Literal
comment: A keyword or tag describing a resource.
comment: Et nøgleord eller tag til beskrivelse af en ressource. @da
comment: Klíčové slovo nebo značka popisující zdroj. @cs
comment: Un mot-clé ou étiquette décrivant une ressource. @fr
comment: Una palabra clave o etiqueta que describe un recurso. @es
comment: Una parola chiave o un'etichetta per descrivere la risorsa. @it
comment: Μία λέξη-κλειδί ή μία ετικέτα που περιγράφει το σύνολο δεδομένων. @el
comment: كلمة مفتاحيه توصف قائمة البيانات @ar
comment: データセットを記述しているキーワードまたはタグ。 @ja
label: klíčové slovo @cs
label: mot-clés @fr
label: nøgleord @da
label: palabra clave @es
label: parola chiave @it
label: λέξη-κλειδί @el
label: كلمة مفتاحية @ar
label: キーワード/タグ @ja

spatial resolution (meters)
type: DatatypeProperty
range: decimal
comment: mindste geografiske afstand som kan erkendes i et datasæt, målt i meter. @da
comment: minimum spatial separation resolvable in a dataset, measured in meters.
comment: minimum spatial separation resolvable in a dataset, measured in metres.
comment: minimální prostorový rozestup rozeznatelný v datové sadě, měřeno v metrech. @cs
comment: mínima separacíon espacial disponible en un conjunto de datos, medida en metros. @es
comment: separazione spaziale minima risolvibile in un set di dati, misurata in metri. @it
label: geografisk opløsning (meter) @da
label: prostorové rozlišení (metry) @cs
label: resolución espacial (metros) @es
label: risoluzione spaziale (metri) @it
label: spatial resolution (metres)
change note: New property added in DCAT 2.
change note: Nová vlastnost přidaná ve verzi DCAT 2. @cs
change note: Nueva propiedad añadida en DCAT 2. @es
change note: Nuova proprietà aggiunta in DCAT 2. @it
change note: Ny genskab tilføjet i DCAT 2. @da
definition: mindste geografiske afstand som kan resolveres i et datasæt, målt i meter. @da
editorial note: Kan optræde i forbindelse med beskrivelse af datasættet eller datasætditributionen, så der er ikke angivet et domæne for egenskaben. @da
editorial note: Might appear in the description of a Dataset or a Distribution, so no domain is specified.
editorial note: Může se vyskytnout v popisu Datové sady nebo Distribuce, takže nebyl specifikován definiční obor. @cs
scope note: Alternative geografiske opløsninger kan leveres som forskellige datasætdistributioner. @da
scope note: Alternative spatial resolutions might be provided as different dataset distributions.
scope note: Distintas distribuciones de un conjunto de datos pueden tener resoluciones espaciales diferentes. @es
scope note: Hvis datasættet udgøres af et billede eller et grid, så bør dette svare til afstanden mellem elementerne. For andre typer af spatiale datasæt, vil denne egenskab typisk indikere den mindste afstand mellem elementerne i datasættet. @da
scope note: If the dataset is an image or grid this should correspond to the spacing of items. For other kinds of spatial dataset, this property will usually indicate the smallest distance between items in the dataset.
scope note: Pokud je datová sada obraz či mřížka, měla by tato vlastnost odpovídat rozestupu položek. Pro ostatní druhy prostorových datových sad bude tato vlastnost obvykle indikovat nejmenší vzdálenost mezi položkami této datové sady. @cs
scope note: Risoluzioni spaziali alternative possono essere fornite come diverse distribuzioni di set di dati. @it
scope note: Různá prostorová rozlišení mohou být poskytována jako různé distribuce datové sady. @cs
scope note: Se il set di dati è un'immagine o una griglia, questo dovrebbe corrispondere alla spaziatura degli elementi. Per altri tipi di set di dati spaziali, questa proprietà di solito indica la distanza minima tra gli elementi nel set di dati. @it
scope note: Si el conjunto de datos es una imágen o grilla, esta propiedad corresponde al espaciado de los elementos. Para otro tipo de conjunto de datos espaciales, esta propieda usualmente indica la menor distancia entre los elementos de dichos datos. @es

start date
type: DatatypeProperty
domain: Period of Time
range: Literal
label: data di inizio @it
label: datum začátku @cs
label: startdato @da
alternative label: starttidspunkt @da
change note: New property added in DCAT 2.
change note: Nová vlastnost přidaná ve verzi DCAT 2. @cs
change note: Nueva propiedad agregada en DCAT 2. @es
change note: Nuova proprietà aggiunta in DCAT 2. @it
change note: Ny egenskab tilføjet i DCAT 2. @da
definition: El comienzo del período @es
definition: L'inizio del periodo @it
definition: Start på perioden. @da
definition: The start of the period
definition: Začátek doby trvání @cs
scope note: El rango de esta propiedad es intencionalmente genérico con el propósito de permitir distintos niveles de precisión temporal para especificar el comienzo de un período. Por ejemplo, puede expresarse como una fecha (xsd:date), una fecha y un tiempo (xsd:dateTime), o un año (xsd:gYear). @es
scope note: Il range di questa proprietà è volutamente generico, con lo scopo di consentire diversi livelli di precisione temporale per specificare l'inizio di un periodo. Ad esempio, può essere espresso con una data (xsd:date), una data e un'ora (xsd:dateTime), o un anno (xsd:gYear). @it
scope note: Obor hodnot této vlastnosti je úmyslně obecný, aby umožnil různé úrovně časového rozlišení pro specifikaci začátku doby trvání. Ten může být kupříkladu vyjádřen datumem (xsd:date), datumem a časem (xsd:dateTime) či rokem (xsd:gYear). @cs
scope note: Rækkeviden for denne egenskab er bevidst generisk defineret med det formål at tillade forskellige niveauer af tidslig præcision ifm. angivelse af startdatoen for en periode. Den kan eksempelvis udtrykkes som en dato (xsd:date), en dato og et tidspunkt (xsd:dateTime), eller et årstal (xsd:gYear). @da
scope note: The range of this property is intentionally generic, with the purpose of allowing different level of temporal precision for specifying the start of a period. E.g., it can be expressed with a date (xsd:date), a date and time (xsd:dateTime), or a year (xsd:gYear).

temporal resolution
type: DatatypeProperty
range: duration
comment: mindste tidsperiode der kan resolveres i datasættet. @da
comment: minimum time period resolvable in a dataset.
comment: minimální doba trvání rozlišitelná v datové sadě. @cs
comment: periodo di tempo minimo risolvibile in un set di dati. @it
comment: período de tiempo mínimo en el conjunto de datos. @es
label: resolución temporal @es
label: risoluzione temporale @it
label: tidslig opløsning @da
label: časové rozlišení @cs
change note: New property added in DCAT 2.
change note: Nová vlastnost přidaná ve verzi DCAT 2. @cs
change note: Nueva propiedad añadida en DCAT 2. @es
change note: Nuova proprietà aggiunta in DCAT 2. @it
editorial note: Kan optræde i forbindelse med beskrivelse af datasættet eller datasætditributionen, så der er ikke angivet et domæne for egenskaben. @da
editorial note: Might appear in the description of a Dataset or a Distribution, so no domain is specified.
editorial note: Může se vyskytnout v popisu Datové sady nebo Distribuce, takže nebyl specifikován definiční obor. @cs
scope note: Alternative temporal resolutions might be provided as different dataset distributions.
scope note: Alternative tidslige opløsninger kan leveres som forskellige datasætdistributioner. @da
scope note: Distintas distribuciones del conjunto de datos pueden tener resoluciones temporales diferentes. @es
scope note: Hvis datasættet er en tidsserie, så bør denne egenskab svare til afstanden mellem elementerne i tidsserien. For andre typer af datasæt indikerer denne egenskab den mindste tidsforskel mellem elementer i datasættet. @da
scope note: If the dataset is a time-series this should correspond to the spacing of items in the series. For other kinds of dataset, this property will usually indicate the smallest time difference between items in the dataset.
scope note: Pokud je datová sada časovou řadou, měla by tato vlastnost odpovídat rozestupu položek v řadě. Pro ostatní druhy datových sad bude tato vlastnost obvykle indikovat nejmenší časovou vzdálenost mezi položkami této datové sady. @cs
scope note: Risoluzioni temporali alternative potrebbero essere fornite come diverse distribuzioni di set di dati. @it
scope note: Různá časová rozlišení mohou být poskytována jako různé distribuce datové sady. @cs
scope note: Se il set di dati è una serie temporale, questo dovrebbe corrispondere alla spaziatura degli elementi della serie. Per altri tipi di set di dati, questa proprietà di solito indica la più piccola differenza di tempo tra gli elementi nel set di dati. @it
scope note: Si el conjunto de datos es una serie temporal, debe corresponder al espaciado de los elementos de la serie. Para otro tipo de conjuntos de datos, esta propiedad indicará usualmente la menor diferencia de tiempo entre elementos en el dataset. @es

version
type: DatatypeProperty
comment: El indicador de versión (nombre o identificador) del recurso. @es
comment: L'indicatore di versione (un nome o un identificatore) di una risorsa. @it
comment: The version indicator (name or identifier) of a resource.
label: versione @it
label: versión @es
change note: New property added in DCAT 3.
change note: Nová vlastnost přidaná ve verzi DCAT 3. @cs
change note: Nueva propiedad agregada in DCAT 3. @es
change note: Nuova proprietà aggiunta in DCAT 3. @it
change note: Ny egenskab tilføjet i DCAT 3. @da
definition: L'indicatore di versione (un nome o un identificatore) di una risorsa @it
scope note: DCAT does not prescribe how a version name / identifier should be specified, and refers for guidance to [DWBP]'s Best Practice 7: Provide a version indicator.
scope note: DCAT no prescribe cómo especificar el nombre or identificador de una versión, y como guía sugiere leer las práctica 7 en [DWBP] sobre cómo proveer un indicador de versión @es
scope note: DCAT non prescrive come un nome o identificatore di versione dovrebbe essere specificato, e fa riferimento alle linee guida indicate in [DWBP] Best Practice 7: Provide a version indicator. @it

atTime
type: DatatypeProperty
domain: InstantaneousEvent
range: dateTime
comment: The time at which an InstantaneousEvent occurred, in the form of xsd:dateTime.
category: qualified
component: entities-activities
shares definition with: InstantaneousEvent
unqualified form: endedAtTime
unqualified form: generatedAtTime
unqualified form: invalidatedAtTime
unqualified form: startedAtTime

endedAtTime
type: DatatypeProperty
domain: Activity
range: dateTime
comment: The time at which an activity ended. See also prov:startedAtTime.
category: starting-point
component: entities-activities
editorial note: It is the intent that the property chain holds: (prov:qualifiedEnd o prov:atTime) rdfs:subPropertyOf prov:endedAtTime.
qualified form: End
qualified form: atTime

generatedAtTime
type: DatatypeProperty
domain: Entity
range: dateTime
comment: The time at which an entity was completely created and is available for use.
category: expanded
component: entities-activities
editorial note: It is the intent that the property chain holds: (prov:qualifiedGeneration o prov:atTime) rdfs:subPropertyOf prov:generatedAtTime.
qualified form: Generation
qualified form: atTime

invalidatedAtTime
type: DatatypeProperty
domain: Entity
range: dateTime
comment: The time at which an entity was invalidated (i.e., no longer usable).
category: expanded
component: entities-activities
editorial note: It is the intent that the property chain holds: (prov:qualifiedInvalidation o prov:atTime) rdfs:subPropertyOf prov:invalidatedAtTime.
qualified form: Invalidation
qualified form: atTime

startedAtTime
type: DatatypeProperty
domain: Activity
range: dateTime
comment: The time at which an activity started. See also prov:endedAtTime.
category: starting-point
component: entities-activities
editorial note: It is the intent that the property chain holds: (prov:qualifiedStart o prov:atTime) rdfs:subPropertyOf prov:startedAtTime.
qualified form: Start
qualified form: atTime

value
type: DatatypeProperty
domain: Entity
category: expanded
component: entities-activities
definition: Provides a value that is a direct representation of an entity.
dm: http://www.w3.org/TR/2013/REC-prov-dm-20130430/#term-attribute-value
editorial note: This property serves the same purpose as rdf:value, but has been reintroduced to avoid some of the definitional ambiguity in the RDF specification (specifically, 'may be used in describing structured values').
editorial note: The editor's definition comes from http://www.w3.org/TR/rdf-primer/#rdfvalue

Agent
type: Class
type: NamedIndividual
type: Agent Class
issued: 2008-01-14
comment: A resource that acts or has the power to act.

Agent Class
type: Class
subclass of: Class
type: NamedIndividual
issued: 2008-01-14
comment: A group of agents.

Bibliographic Resource
type: Class
type: NamedIndividual
issued: 2008-01-14
comment: A book, article, or other documentary resource.

File Format
type: Class
subclass of: Media Type
type: NamedIndividual
issued: 2008-01-14
comment: A digital resource format.

Frequency
type: Class
type: NamedIndividual
issued: 2008-01-14
comment: A rate at which something recurs.

Jurisdiction
type: Class
subclass of: Location, Period, or Jurisdiction
type: NamedIndividual
issued: 2008-01-14
comment: The extent or range of judicial, law enforcement, or other authority.

License Document
type: Class
subclass of: Rights Statement
type: NamedIndividual
issued: 2008-01-14
comment: A legal document giving official permission to do something with a resource.

Linguistic System
type: Class
type: NamedIndividual
issued: 2008-01-14
description: Written, spoken, sign, and computer languages are linguistic systems.
comment: A system of signs, symbols, sounds, gestures, or rules used in communication.

Location
type: Class
subclass of: Location, Period, or Jurisdiction
type: NamedIndividual
issued: 2008-01-14
comment: A spatial region or named place.

Location, Period, or Jurisdiction
type: Class
type: NamedIndividual
issued: 2008-01-14
comment: A location, period of time, or jurisdiction.

Media Type
type: Class
subclass of: Media Type or Extent
type: NamedIndividual
issued: 2008-01-14
comment: A file format or physical medium.

Media Type or Extent
type: Class
type: NamedIndividual
issued: 2008-01-14
comment: A media type or extent.

Method of Accrual
type: Class
type: NamedIndividual
issued: 2008-01-14
comment: A method by which resources are added to a collection.

Method of Instruction
type: Class
type: NamedIndividual
issued: 2008-01-14
comment: A process that is used to engender knowledge, attitudes, and skills.

Period of Time
type: Class
subclass of: Location, Period, or Jurisdiction
type: NamedIndividual
issued: 2008-01-14
comment: An interval of time that is named or defined by its start and end dates.

Physical Medium
type: Class
subclass of: Media Type
type: NamedIndividual
issued: 2008-01-14
description: Examples include paper, canvas, or DVD.
comment: A physical material or carrier.

Physical Resource
type: Class
type: NamedIndividual
issued: 2008-01-14
comment: A material thing.

Policy
type: Class
type: NamedIndividual
issued: 2008-01-14
comment: A plan or course of action by an authority, intended to influence and determine decisions, actions, and other matters.

Provenance Statement
type: Class
type: NamedIndividual
issued: 2008-01-14
comment: Any changes in ownership and custody of a resource since its creation that are significant for its authenticity, integrity, and interpretation.

Rights Statement
type: Class
type: NamedIndividual
issued: 2008-01-14
comment: A statement about the intellectual property rights (IPR) held in or over a resource, a legal document giving official permission to do something with a resource, or a statement about access rights.

Size or Duration
type: Class
subclass of: Media Type or Extent
type: NamedIndividual
issued: 2008-01-14
description: Examples include a number of pages, a specification of length, width, and breadth, or a period in hours, minutes, and seconds.
comment: A dimension or extent, or a time taken to play or execute.

Standard
type: Class
type: NamedIndividual
issued: 2008-01-14
comment: A reference point against which other things can be evaluated or compared.

Categorization
type: Class
comment: An Hierarchy of dataAsset categories
label: Categorization

Consumer
type: Class
comment: Consumers discover and subscribe to dataAssets of interest via api / interfaces in order to access the resources.

ContractParameters
type: Class
comment: Contract Parameters
label: ContractParameters

DataExchangeSpec
type: Class
usage note: Class for kind of a service level specification of the secure data exchange and unequivocally set the cryptographic algorithms that will be used, and the maximum acceptable delays for the proper reception of the data blocks that will be exchanged.
comment: Kind of a service level specification of the secure data exchange and unequivocally set the cryptographic algorithms that will be used, and the maximum acceptable delays for the proper reception of the data blocks that will be exchanged

DataSource
type: Class
comment: Data Source information.

Dataset Information
type: Class
usage note: Optional class. A description of types which represent attributes of observations , measurements , fields,.. in the dataset..
comment: A record in a data set, describing types which represent attributes of observations , measurements , fields,.. in the dataset..

datasetQuery
type: Class
subclass of: Demand
comment: Consumers discover dataAssets they're interesting through tohsaKB by providing an (dataAsset) query. The query entails a specification of the type of dataAssets the consumer is interested in

Dataset Record
type: Class
usage note: Optional class. A description of types which represent attributes of observations , measurements , fields,.. in the dataset..
comment: A record in a data set, describing types which represent attributes of observations , measurements , fields,.. in the dataset..

datasetSubscription
type: Class
comment: Subscription of a consumer to a specific dataAsset registered by a provider.

Experiment Information
type: Class
usage note: Optional class. A description of types which represent attributes of observations , measurements , fields,.. in the dataset..
comment: A record in a data set, describing types which represent attributes of observations , measurements , fields,.. in the dataset..

IntendedUse
type: Class
comment: Intended Use of the data

LicenseGrant
type: Class
comment: License Grant

Organization
type: Class
comment: Organization

Owner
type: Class
comment: The original Owner of the Data that make available via providers and provides access to the offered resources via a common API.

Provider
type: Class
comment: Providers register their dataAssets on TOHSAkb and provides access to the offered resources via a common API.

QueryFilters
type: Class
comment: Contains The Parameters/Properties that were chosen for the query/search of the dataAssets by Consumer

Sample
type: Class
comment: Sample information.

datasetCategory
type: Class
comment: Category of a dataAsset.

datasetSubscription
type: Class
comment: Subscription of a consumer to a specific dataAsset registered by a provider.

Collection
type: Class
disjoint with: Concept
disjoint with: Concept Scheme
definition: A meaningful collection of concepts.
scope note: Labelled collections can be used where you would like a set of concepts to be displayed under a 'node label' in the hierarchy.

Concept
type: Class
disjoint with: Concept Scheme
definition: An idea or notion; a unit of thought.

Concept Scheme
type: Class
definition: A set of concepts, optionally including statements about semantic relationships between those concepts.
example: Thesauri, classification schemes, subject heading lists, taxonomies, 'folksonomies', and other types of controlled vocabulary are all examples of concept schemes. Concept schemes are also embedded in glossaries and terminologies.
scope note: A concept scheme may be defined to include concepts from different sources.

Ordered Collection
type: Class
subclass of: Collection
definition: An ordered collection of concepts, where both the grouping and the ordering are meaningful.
scope note: Ordered collections can be used where you would like a set of concepts to be displayed in a specific order, and optionally under a 'node label'.

Catalog
type: Class
subclass of: Dataset
comment: A curated collection of metadata about resources (e.g., datasets and data services in the context of a data catalog).
comment: En udvalgt og arrangeret samling af metadata om ressourcer (fx datasæt og datatjenester i kontekst af et datakatalog). @da
comment: Una colección curada de metadatos sobre recursos (por ejemplo, conjuntos de datos y servicios de datos en el contexto de un catálogo de datos). @es
comment: Una raccolta curata di metadati sulle risorse (ad es. sui dataset e relativi servizi nel contesto di cataloghi di dati). @it
comment: Une collection élaborée de métadonnées sur les jeux de données @fr
comment: Řízená kolekce metadat o datových sadách a datových službách @cs
comment: Μια επιμελημένη συλλογή μεταδεδομένων περί συνόλων δεδομένων @el
comment: مجموعة من توصيفات قوائم البيانات @ar
comment: データ・カタログは、データセットに関するキュレートされたメタデータの集合です。 @ja
label: Catalogo @it
label: Catalogue @fr
label: Catálogo @es
label: Katalog @cs
label: Κατάλογος @el
label: فهرس قوائم البيانات @ar
label: カタログ @ja
definition: A curated collection of metadata about resources.
definition: En samling af metadata om ressourcer. @da
definition: Una colección curada de metadatos sobre recursos. @es
definition: Una raccolta curata di metadati sulle risorse. @it
definition: Une collection élaborée de métadonnées sur les jeux de données. @fr
definition: Řízená kolekce metadat o datových sadách a datových službách. @cs
definition: Μια επιμελημένη συλλογή μεταδεδομένων περί συνόλων δεδομένων. @el
editorial note: Multilingual text not completelly updated. Translations for skos:scopeNote and definitions to doublecheck.
scope note: A web-based data catalog is typically represented as a single instance of this class.
scope note: Datasets and data services are examples of resources in the context of a data catalog.
scope note: Et webbaseret datakatalog repræsenteres typisk ved en enkelt instans af denne klasse. @da
scope note: Normalmente, un catalogo di dati nel web viene rappresentato come una singola istanza di questa classe. @it
scope note: Normalmente, un catálogo de datos disponible en la web se representa como una única instancia de esta clase. @es
scope note: Webový datový katalog je typicky reprezentován jako jedna instance této třídy. @cs
scope note: Συνήθως, ένας κατάλογος δεδομένων στον Παγκόσμιο Ιστό αναπαρίσταται ως ένα στιγμιότυπο αυτής της κλάσης. @el
scope note: 通常、ウェブ・ベースのデータ・カタログは、このクラスの1つのインスタンスとして表わされます。 @ja

Catalog Record
type: Class
subclass of: Restriction
  on property: primaryTopic
  all values from: Catalogued resource
subclass of: Restriction
  on property: primaryTopic
  cardinality: 1
comment: 1つのデータセットを記述したデータ・カタログ内のレコード。 @ja
comment: A record in a data catalog, describing the registration of a single dataset or data service.
comment: En post i et datakatalog der beskriver registreringen af et enkelt datasæt eller en datatjeneste. @da
comment: Un record in un catalogo di dati che descrive un singolo dataset o servizio di dati. @it
comment: Un registre du catalogue ou une entrée du catalogue, décrivant un seul jeu de données. @fr
comment: Un registro en un catálogo de datos que describe un solo conjunto de datos o un servicio de datos. @es
comment: Záznam v datovém katalogu popisující jednu datovou sadu či datovou službu. @cs
comment: Μία καταγραφή ενός καταλόγου, η οποία περιγράφει ένα συγκεκριμένο σύνολο δεδομένων. @el
label: Katalogizační záznam @cs
label: Katalogpost @da
label: Record di catalogo @it
label: Registre du catalogue @fr
label: Registro del catálogo @es
label: Καταγραφή καταλόγου @el
label: سجل @ar
label: カタログ・レコード @ja
editorial note: English definition updated in this revision. Multilingual text not yet updated except the Spanish one and the Czech one and Italian one.
scope note: C'est une classe facultative et tous les catalogues ne l'utiliseront pas. Cette classe existe pour les catalogues ayant une distinction entre les métadonnées sur le jeu de données et les métadonnées sur une entrée du jeu de données dans le catalogue. @fr
scope note: Denne klasse er valgfri og ikke alle kataloger vil anvende denne klasse. Den kan anvendes i de kataloger hvor der skelnes mellem metadata om datasættet eller datatjenesten og metadata om selve posten til registreringen af datasættet eller datatjenesten i kataloget. Udgivelsesdatoen for datasættet afspejler for eksempel den dato hvor informationerne oprindeligt blev gjort tilgængelige af udgiveren, hvorimod udgivelsesdatoen for katalogposten er den dato hvor datasættet blev føjet til kataloget. I de tilfælde hvor de to datoer er forskellige eller hvor blot sidstnævnte er kendt, bør udgivelsesdatoen kun angives for katalogposten. Bemærk at W3Cs PROV ontologi gør til muligt at tilføje yderligere proveniensoplysninger eksempelvis om processen eller aktøren involveret i en given ændring af datasættet. @da
scope note: Esta clase es opcional y no todos los catálogos la utilizarán. Esta clase existe para catálogos que hacen una distinción entre los metadatos acerca de un conjunto de datos o un servicio de datos y los metadatos acerca de una entrada en ese conjunto de datos en el catálogo. Por ejemplo, la propiedad sobre la fecha de la publicación de los datos refleja la fecha en que la información fue originalmente publicada, mientras que la fecha de publicación del registro del catálogo es la fecha en que los datos se agregaron al mismo. En caso en que ambas fechas fueran diferentes, o en que sólo la fecha de publicación del registro del catálogo estuviera disponible, sólo debe especificarse en el registro del catálogo. Tengan en cuenta que la ontología PROV de W3C permite describir otra información sobre la proveniencia de los datos, como por ejemplo detalles del proceso y de los agentes involucrados en algún cambio específico a los datos. @es
scope note: Questa classe è opzionale e non tutti i cataloghi la utilizzeranno. Esiste per cataloghi in cui si opera una distinzione tra i metadati relativi al dataset ed i metadati relativi alla gestione del dataset nel catalogo. Ad esempio, la proprietà per indicare la data di pubblicazione del dataset rifletterà la data in cui l'informazione è stata originariamente messa a disposizione dalla casa editrice, mentre la data di pubblicazione per il record nel catalogo rifletterà la data in cui il dataset è stato aggiunto al catalogo. Nei casi dove solo quest'ultima sia nota, si utilizzerà esclusivamente la data di pubblicazione relativa al record del catalogo. Si noti che l'Ontologia W3C PROV permette di descrivere ulteriori informazioni sulla provenienza, quali i dettagli del processo, la procedura e l'agente coinvolto in una particolare modifica di un dataset. @it
scope note: Tato třída je volitelná a ne všechny katalogy ji využijí. Existuje pro katalogy, ve kterých se rozlišují metadata datové sady či datové služby a metadata o záznamu o datové sadě či datové službě v katalogu. Například datum publikace datové sady odráží datum, kdy byla datová sada původně zveřejněna poskytovatelem dat, zatímco datum publikace katalogizačního záznamu je datum zanesení datové sady do katalogu. V případech kdy se obě data liší, nebo je známo jen to druhé, by mělo být specifikováno jen datum publikace katalogizačního záznamu. Všimněte si, že ontologie W3C PROV umožňuje popsat další informace o původu jako například podrobnosti o procesu konkrétní změny datové sady a jeho účastnících. @cs
scope note: This class is optional and not all catalogs will use it. It exists for catalogs where a distinction is made between metadata about a dataset or data service and metadata about the entry for the dataset or data service in the catalog. For example, the publication date property of the dataset reflects the date when the information was originally made available by the publishing agency, while the publication date of the catalog record is the date when the dataset was added to the catalog. In cases where both dates differ, or where only the latter is known, the publication date should only be specified for the catalog record. Notice that the W3C PROV Ontology allows describing further provenance information such as the details of the process and the agent involved in a particular change to a dataset.
scope note: Αυτή η κλάση είναι προαιρετική και δεν χρησιμοποιείται από όλους τους καταλόγους. Υπάρχει για τις περιπτώσεις καταλόγων όπου γίνεται διαχωρισμός μεταξύ των μεταδεδομένων για το σύνολο των δεδομένων και των μεταδεδομένων για την καταγραφή του συνόλου δεδομένων εντός του καταλόγου. Για παράδειγμα, η ιδιότητα της ημερομηνίας δημοσίευσης του συνόλου δεδομένων δείχνει την ημερομηνία κατά την οποία οι πληροφορίες έγιναν διαθέσιμες από τον φορέα δημοσίευσης, ενώ η ημερομηνία δημοσίευσης της καταγραφής του καταλόγου δείχνει την ημερομηνία που το σύνολο δεδομένων προστέθηκε στον κατάλογο. Σε περιπτώσεις που οι δύο ημερομηνίες διαφέρουν, ή που μόνο η τελευταία είναι γνωστή, η ημερομηνία δημοσίευσης θα πρέπει να δίνεται για την καταγραφή του καταλόγου. Να σημειωθεί πως η οντολογία W3C PROV επιτρέπει την περιγραφή επιπλέον πληροφοριών ιστορικού όπως λεπτομέρειες για τη διαδικασία και τον δράστη που εμπλέκονται σε μία συγκεκριμένη αλλαγή εντός του συνόλου δεδομένων. @el
scope note: このクラスはオプションで、すべてのカタログがそれを用いるとは限りません。これは、データセットに関するメタデータとカタログ内のデータセットのエントリーに関するメタデータとで区別が行われるカタログのために存在しています。例えば、データセットの公開日プロパティーは、公開機関が情報を最初に利用可能とした日付を示しますが、カタログ・レコードの公開日は、データセットがカタログに追加された日付です。両方の日付が異っていたり、後者だけが分かっている場合は、カタログ・レコードに対してのみ公開日を指定すべきです。W3CのPROVオントロジー[prov-o]を用いれば、データセットに対する特定の変更に関連するプロセスやエージェントの詳細などの、さらに詳しい来歴情報の記述が可能となることに注意してください。 @ja

Data service
type: Class
subclass of: Service
subclass of: Catalogued resource
comment: A site or end-point providing operations related to the discovery of, access to, or processing functions on, data or related resources.
comment: Et websted eller endpoint der udstiller operationer relateret til opdagelse af, adgang til eller behandlende funktioner på data eller relaterede ressourcer. @da
comment: Umístění či přístupový bod poskytující operace související s hledáním, přistupem k, či výkonem funkcí na datech či souvisejících zdrojích. @cs
comment: Un sitio o end-point que provee operaciones relacionadas a funciones de descubrimiento, acceso, o procesamiento de datos o recursos relacionados. @es
comment: Un sito o end-point che fornisce operazioni relative alla scoperta, all'accesso o all'elaborazione di funzioni su dati o risorse correlate. @it
label: Datatjeneste @da
label: Servicio de datos @es
label: Servizio di dati @it
alternative label: Dataservice @da
change note: New class added in DCAT 2.
change note: Nová třída přidaná ve verzi DCAT 2. @cs
change note: Nueva clase añadida en DCAT 2. @es
change note: Nuova classe aggiunta in DCAT 2. @it
change note: Ny klasse tilføjet i DCAT 2. @da
definition: Et site eller endpoint der udstiller operationer relateret til opdagelse af, adgang til eller behandlende funktioner på data eller relaterede ressourcer. @da
scope note: Datatjenestetypen kan indikeres ved hjælp af egenskaben dcterms:type. Værdien kan tages fra kontrollerede udfaldsrum såsom INSPIRE spatial data service vocabulary. @da
scope note: Druh služby může být indikován vlastností dcterms:type. Její hodnota může být z řízeného slovníku, kterým je například slovník typů prostorových datových služeb INSPIRE. @cs
scope note: El tipo de servicio puede indicarse usando la propiedad dcterms:type. Su valor puede provenir de un vocabulario controlado, como por ejemplo el vocabulario de servicios de datos espaciales de INSPIRE. @es
scope note: Hvis en dcat:DataService er bundet til en eller flere specifikke datasæt kan dette indikeres ved hjælp af egenskaben dcat:servesDataset. @da
scope note: If a dcat:DataService is bound to one or more specified Datasets, they are indicated by the dcat:servesDataset property.
scope note: Il tipo di servizio può essere indicato usando la proprietà dcterms:type. Il suo valore può essere preso da un vocabolario controllato come il vocabolario dei tipi di servizi per dati spaziali di INSPIRE. @it
scope note: Pokud je dcat:DataService navázána na jednu či více Datových sad, jsou tyto indikovány vlstností dcat:servesDataset. @cs
scope note: Se un dcat:DataService è associato a uno o più Dataset specificati, questi sono indicati dalla proprietà dcat:serveDataset. @it
scope note: Si un dcat:DataService está asociado con uno o más conjuntos de datos especificados, dichos conjuntos de datos pueden indicarse con la propiedad dcat:servesDataset. @es
scope note: The kind of service can be indicated using the dcterms:type property. Its value may be taken from a controlled vocabulary such as the INSPIRE spatial data service type vocabulary.

Dataset
type: Class
subclass of: Catalogued resource
comment: 1つのエージェントによって公開またはキュレートされ、1つ以上の形式でアクセスまたはダウンロードできるデータの集合。 @ja
comment: A collection of data, published or curated by a single source, and available for access or download in one or more representations.
comment: En samling af data, udgivet eller udvalgt og arrangeret af en enkelt kilde og som er til råde for adgang til eller download af i en eller flere repræsentationer. @da
comment: Kolekce dat poskytovaná či řízená jedním zdrojem, která je k dispozici pro přístup či stažení v jednom či více formátech. @cs
comment: Raccolta di dati, pubblicati o curati da un'unica fonte, disponibili per l'accesso o il download in uno o più formati. @it
comment: Una colección de datos, publicados o conservados por una única fuente, y disponibles para ser accedidos o descargados en uno o más formatos. @es
comment: Une collection de données, publiée ou élaborée par une seule source, et disponible pour accès ou téléchargement dans un ou plusieurs formats. @fr
comment: Μία συλλογή από δεδομένα, δημοσιευμένη ή επιμελημένη από μία και μόνο πηγή, διαθέσιμη δε προς πρόσβαση ή μεταφόρτωση σε μία ή περισσότερες μορφές. @el
comment: قائمة بيانات منشورة أو مجموعة من قبل مصدر ما و متاح الوصول إليها أو تحميلها @ar
label: Conjunto de datos @es
label: Datasæt @da
label: Datová sada @cs
label: Jeu de données @fr
label: Σύνολο Δεδομένων @el
label: قائمة بيانات @ar
label: データセット @ja
alternative label: Datasamling @da
change note: 2018-02 - odstraněno tvrzení o podtřídě dctype:Dataset, jelikož rozsah dcat:Dataset zahrnuje několik dalších typů ze slovníku dctype. @cs
change note: 2018-02 - se eliminó el axioma de subclase con dctype:Dataset porque el alcance de dcat:Dataset incluye muchos otros tipos del vocabulario dctype. @es
change note: 2018-02 - sottoclasse di dctype:Dataset rimosso perché l'ambito di dcat:Dataset include diversi altri tipi dal vocabolario dctype. @it
change note: 2018-02 - subclass of dctype:Dataset removed because scope of dcat:Dataset includes several other types from the dctype vocabulary.
change note: 2018-02 - subklasse af dctype:Dataset fjernet da scope af dcat:Dataset omfatter flere forskellige typer fra dctype-vokabularet. @da
definition: En samling a data, udgivet eller udvalgt og arrangeret af en enkelt kilde og som der er adgang til i en eller flere repræsentationer. @da
editorial note: 2020-03-16 A new scopenote added and need to be translated
scope note: Cette classe représente le jeu de données publié par le fournisseur de données. Dans les cas où une distinction est nécessaire entre le jeu de donénes et son entrée dans le catalogue, la classe registre de données peut être utilisée pour ce dernier. @fr
scope note: Denne klasse beskriver det konceptuelle datasæt. En eller flere repræsentationer kan være tilgængelige med forskellige skematiske opsætninger, formater eller serialiseringer. @da
scope note: Denne klasse repræsenterer det konkrete datasæt som det udgives af datasætleverandøren. I de tilfælde hvor det er nødvendigt at skelne mellem det konkrete datasæt og dets registrering i kataloget (fordi metadata såsom ændringsdato og vedligeholder er forskellige), så kan klassen katalogpost anvendes. @da
scope note: Esta clase representa el conjunto de datos publicados. En los casos donde es necesario distinguir entre el conjunto de datos y su entrada en el catálogo de datos, se debe utilizar la clase 'registro del catálogo'. @es
scope note: Questa classe descrive il dataset dal punto di vista concettuale. Possono essere disponibili una o più rappresentazioni, con diversi layout e formati schematici o serializzazioni. @it
scope note: Questa classe rappresenta il dataset come pubblicato dall’editore. Nel caso in cui sia necessario operare una distinzione fra i metadati originali del dataset e il record dei metadati ad esso associato nel catalogo (ad esempio, per distinguere la data di modifica del dataset da quella del dataset nel catalogo) si può impiegare la classe catalog record. @it
scope note: Tato třída reprezentuje datovou sadu tak, jak je publikována poskytovatelem dat. V případě potřeby rozlišení datové sady a jejího katalogizačního záznamu (jelikož metadata jako datum modifikace se mohou lišit) pro něj může být použita třída "katalogizační záznam". @cs
scope note: The notion of dataset in DCAT is broad and inclusive, with the intention of accommodating resource types arising from all communities. Data comes in many forms including numbers, text, pixels, imagery, sound and other multi-media, and potentially other types, any of which might be collected into a dataset.
scope note: This class describes the conceptual dataset. One or more representations might be available, with differing schematic layouts and formats or serializations.
scope note: This class represents the actual dataset as published by the dataset provider. In cases where a distinction between the actual dataset and its entry in the catalog is necessary (because metadata such as modification date and maintainer might differ), the catalog record class can be used for the latter.
scope note: Η κλάση αυτή αναπαριστά το σύνολο δεδομένων αυτό καθ'εαυτό, όπως έχει δημοσιευθεί από τον εκδότη. Σε περιπτώσεις όπου είναι απαραίτητος ο διαχωρισμός μεταξύ του συνόλου δεδομένων και της καταγραφής αυτού στον κατάλογο (γιατί μεταδεδομένα όπως η ημερομηνία αλλαγής και ο συντηρητής μπορεί να διαφέρουν) η κλάση της καταγραφής καταλόγου μπορεί να χρησιμοποιηθεί για το τελευταίο. @el
scope note: このクラスは、データセットの公開者が公開する実際のデータセットを表わします。カタログ内の実際のデータセットとそのエントリーとの区別が必要な場合（修正日と維持者などのメタデータが異なるかもしれないので）は、後者にcatalog recordというクラスを使用できます。 @ja

Dataset series
type: Class
subclass of: Dataset
comment: A collection of datasets that are published separately, but share some characteristics that group them.
comment: Una colección de conjuntos de datos publicados por separado, pero que comparten características que los agrupan. @es
comment: Una collezione di dataset che sono pubblicati separatamente, ma che condividono caratteristiche che li rendono parte di uno stesso gruppo. @it
label: Serie de conjuntos de datos @es
label: Serie di dataset @it
change note: New class added in DCAT 3.
change note: Nová třída přidaná ve verzi DCAT 3 @cs
change note: Nueva clase agregada en DCAT 3. @es
change note: Nuova classe aggiunta in DCAT 3 @it
change note: Ny klasse tilføjet i DCAT 3 @da
definition: A collection of datasets that are published separately, but share some common characteristics that groups them.
definition: Una colección de conjuntos de datos publicados por separado, pero que comparten características comunes que los agrupan. @es
editorial note: 2022-05-08 Added to ttl file with annotations in English, Spanish and Italian, except notes that are in other languages too.
scope note: Algunos escenarios comunes para series de conjuntos de datos son: series temporales compuestas de subconjuntos de datos publicados periódicamente; series de mapas compuestos de elementos del mismo tipo o tema pero con distintas huellas espaciales. @es
scope note: Common scenarios for dataset series include: time series composed of periodically released subsets; map-series composed of items of the same type or theme but with differing spatial footprints.
scope note: Dataset series can be also soft-typed via property dcterms:type as in the approach used in [GeoDCAT-AP], and adopted in [DCAT-AP-IT] and [GeoDCAT-AP-IT]).
scope note: Le serie di dati possono anche essere denotate come tali usando la proprietà dcterms:type, secondo l'approccio usato in [GeoDCAT-AP], e adottato in [DCAT-AP-IT] e [GeoDCAT-AP-IT]). @it
scope note: Scenari tipici per l'uso di serie di dataset: serie temporali costituite di dataset pubblicati regolarmente; serie di mappe costituite da elementi dello stesso tipo o tematica ma relative a differenti aree geografiche. @it
scope note: También puede asignarse un tipo a las series de datos usando la propiedad dcterms:type como se hace en [GeoDCAT-AP], y adoptado en [DCAT-AP-IT] y [GeoDCAT-AP-IT]). @es

Distribuce
type: Class
comment: A specific representation of a dataset. A dataset might be available in multiple serializations that may differ in various ways, including natural language, media-type or format, schematic organization, temporal and spatial resolution, level of detail or profiles (which might specify any or all of the above).
comment: En specifik repræsentation af et datasæt. Et datasæt kan være tilgængelig i mange serialiseringer der kan variere på forskellige vis, herunder sprog, medietype eller format, systemorganisering, tidslig- og geografisk opløsning, detaljeringsniveau eller profiler (der kan specificere en eller flere af ovenstående). @da
comment: Konkrétní reprezentace datové sady. Datová sada může být dostupná v různých serializacích, které se mohou navzájem lišit různými způsoby, mimo jiné přirozeným jazykem, media-typem či formátem, schematickou organizací, časovým a prostorovým rozlišením, úrovní detailu či profily (které mohou specifikovat některé či všechny tyto rozdíly). @cs
comment: Rappresenta una forma disponibile e specifica del dataset. Ciascun dataset può essere disponibile in forme differenti, che possono rappresentare formati diversi o diversi punti di accesso per un dataset. Esempi di distribuzioni sono un file CSV scaricabile, una API o un RSS feed. @it
comment: Représente une forme spécifique d'un jeu de données. Caque jeu de données peut être disponible sous différentes formes, celles-ci pouvant représenter différents formats du jeu de données ou différents endpoint. Des exemples de distribution sont des fichirs CSV, des API ou des flux RSS. @fr
comment: Una representación específica de los datos. Cada conjunto de datos puede estar disponible en formas diferentes, las cuáles pueden variar en distintas formas, incluyendo el idioma, 'media-type' o formato, organización esquemática, resolución temporal y espacial, nivel de detalle o perfiles (que pueden especificar cualquiera o todas las diferencias anteriores). @es
comment: Αναπαριστά μία συγκεκριμένη διαθέσιμη μορφή ενός συνόλου δεδομένων. Κάθε σύνολο δεδομενων μπορεί να είναι διαθέσιμο σε διαφορετικές μορφές, οι μορφές αυτές μπορεί να αναπαριστούν διαφορετικές μορφές αρχείων ή διαφορετικά σημεία διάθεσης. Παραδείγματα διανομών συμπεριλαμβάνουν ένα μεταφορτώσιμο αρχείο μορφής CSV, ένα API ή ένα RSS feed. @el
comment: شكل محدد لقائمة البيانات يمكن الوصول إليه. قائمة بيانات ما يمكن أن تكون متاحه باشكال و أنواع متعددة. ملف يمكن تحميله أو واجهة برمجية يمكن من خلالها الوصول إلى البيانات هي أمثلة على ذلك. @ar
comment: データセットの特定の利用可能な形式を表わします。各データセットは、異なる形式で利用できることがあり、これらの形式は、データセットの異なる形式や、異なるエンドポイントを表わす可能性があります。配信の例には、ダウンロード可能なCSVファイル、API、RSSフィードが含まれます。 @ja
label: Distribución @es
label: Distribution
label: Distribuzione @it
label: Διανομή @el
label: التوزيع @ar
label: 配信 @ja
alternative label: Datadistribution @da
alternative label: Datamanifestation @da
alternative label: Datarepræsentation @da
alternative label: Dataudstilling @da
scope note: Ceci représente une disponibilité générale du jeu de données, et implique qu'il n'existe pas d'information sur la méthode d'accès réelle des données, par exple, si c'est un lien de téléchargement direct ou à travers une page Web. @fr
scope note: Denne klasse repræsenterer datasættets overordnede tilgængelighed og giver ikke oplysninger om hvilken metode der kan anvendes til at få adgang til data, dvs. om adgang til datasættet realiseres ved direkte download, API eller via et websted. Anvendelsen af egenskaben dcat:downloadURL indikerer at distributionen kan downloades direkte. @da
scope note: Esta clase representa una disponibilidad general de un conjunto de datos, e implica que no existe información acerca del método de acceso real a los datos, i.e., si es un enlace de descarga directa o a través de una página Web. @es
scope note: Questa classe rappresenta una disponibilità generale di un dataset e non implica alcuna informazione sul metodo di accesso effettivo ai dati, ad esempio se si tratta di un accesso a download diretto, API, o attraverso una pagina Web. L'utilizzo della proprietà dcat:downloadURL indica distribuzioni direttamente scaricabili. @it
scope note: This represents a general availability of a dataset it implies no information about the actual access method of the data, i.e. whether by direct download, API, or through a Web page. The use of dcat:downloadURL property indicates directly downloadable distributions.
scope note: Toto popisuje obecnou dostupnost datové sady. Neimplikuje žádnou informaci o skutečné metodě přístupu k datům, tj. zda jsou přímo ke stažení, skrze API či přes webovou stránku. Použití vlastnosti dcat:downloadURL indikuje přímo stažitelné distribuce. @cs
scope note: Αυτό αναπαριστά μία γενική διαθεσιμότητα ενός συνόλου δεδομένων και δεν υπονοεί τίποτα περί του πραγματικού τρόπου πρόσβασης στα δεδομένα, αν είναι άμεσα μεταφορτώσιμα, μέσω API ή μέσω μίας ιστοσελίδας. Η χρήση της ιδιότητας dcat:downloadURL δείχνει μόνο άμεσα μεταφορτώσιμες διανομές. @el
scope note: これは、データセットの一般的な利用可能性を表わし、データの実際のアクセス方式に関する情報（つまり、直接ダウンロードなのか、APIなのか、ウェブページを介したものなのか）を意味しません。dcat:downloadURLプロパティーの使用は、直接ダウンロード可能な配信を意味します。 @ja

Relationship
type: Class
comment: An association class for attaching additional information to a relationship between DCAT Resources.
comment: Asociační třída pro připojení dodatečných informací ke vztahu mezi zdroji DCAT. @cs
comment: En associationsklasse til brug for tilknytning af yderligere information til en relation mellem DCAT-ressourcer. @da
comment: Una clase de asociación para adjuntar información adicional a una relación entre recursos DCAT. @es
comment: Una classe di associazione per il collegamento di informazioni aggiuntive a una relazione tra le risorse DCAT. @it
label: Relación @es
label: Relation @da
label: Relazione @it
label: Vztah @cs
change note: New class added in DCAT 2
change note: Nová třída přidaná ve verzi DCAT 2 @cs
change note: Nueva clase añadida en DCAT 2 @es
change note: Nuova classe aggiunta in DCAT 2 @it
change note: Ny klasse i DCAT 2 @da
scope note: Anvendes til at karakterisere en relation mellem datasæt, og potentielt andre ressourcer, hvor relationen er kendt men ikke tilstrækkeligt beskrevet af de standardiserede egenskaber i Dublin Core (dcterms:hasPart, dcterms:isPartOf, dcterms:conformsTo, dcterms:isFormatOf, dcterms:hasFormat, dcterms:isVersionOf, dcterms:hasVersion, dcterms:replaces, dcterms:isReplacedBy, dcterms:references, dcterms:isReferencedBy, dcterms:requires, dcterms:isRequiredBy) eller PROV-O-egenskaber (prov:wasDerivedFrom, prov:wasInfluencedBy, prov:wasQuotedFrom, prov:wasRevisionOf, prov:hadPrimarySource, prov:alternateOf, prov:specializationOf). @da
scope note: Používá se pro charakterizaci vztahu mezi datovými sadami a případně i jinými zdroji, kde druh vztahu je sice znám, ale není přiměřeně charakterizován standardními vlastnostmi slovníku Dublin Core (dcterms:hasPart, dcterms:isPartOf, dcterms:conformsTo, dcterms:isFormatOf, dcterms:hasFormat, dcterms:isVersionOf, dcterms:hasVersion, dcterms:replaces, dcterms:isReplacedBy, dcterms:references, dcterms:isReferencedBy, dcterms:requires, dcterms:isRequiredBy) či vlastnostmi slovníku PROV-O (prov:wasDerivedFrom, prov:wasInfluencedBy, prov:wasQuotedFrom, prov:wasRevisionOf, prov:hadPrimarySource, prov:alternateOf, prov:specializationOf). @cs
scope note: Se usa para caracterizar la relación entre conjuntos de datos, y potencialmente otros recursos, donde la naturaleza de la relación se conoce pero no está caracterizada adecuadamente con propiedades del estándar 'Dublin Core' (dcterms:hasPart, dcterms:isPartOf, dcterms:conformsTo, dcterms:isFormatOf, dcterms:hasFormat, dcterms:isVersionOf, dcterms:hasVersion, dcterms:replaces, dcterms:isReplacedBy, dcterms:references, dcterms:isReferencedBy, dcterms:requires, dcterms:isRequiredBy) or PROV-O properties (prov:wasDerivedFrom, prov:wasInfluencedBy, prov:wasQuotedFrom, prov:wasRevisionOf, prov:hadPrimarySource, prov:alternateOf, prov:specializationOf). @es
scope note: Use to characterize a relationship between datasets, and potentially other resources, where the nature of the relationship is known but is not adequately characterized by the standard Dublin Core properties (dcterms:hasPart, dcterms:isPartOf, dcterms:conformsTo, dcterms:isFormatOf, dcterms:hasFormat, dcterms:isVersionOf, dcterms:hasVersion, dcterms:replaces, dcterms:isReplacedBy, dcterms:references, dcterms:isReferencedBy, dcterms:requires, dcterms:isRequiredBy) or PROV-O properties (prov:wasDerivedFrom, prov:wasInfluencedBy, prov:wasQuotedFrom, prov:wasRevisionOf, prov:hadPrimarySource, prov:alternateOf, prov:specializationOf).
scope note: Viene utilizzato per caratterizzare la relazione tra insiemi di dati, e potenzialmente altri tipi di risorse, nei casi in cui la natura della relazione è nota ma non adeguatamente caratterizzata dalle proprietà dello standard 'Dublin Core' (dcterms:hasPart, dcterms:isPartOf, dcterms:conformsTo, dcterms:isFormatOf, dcterms:hasFormat, dcterms:isVersionOf, dcterms:hasVersion, dcterms:replaces, dcterms:isReplacedBy, dcterms:references, dcterms:isReferencedBy, dcterms:require, dcterms:isRequiredBy) o dalle propietà fornite da PROV-O (prov:wasDerivedFrom, prov:wasInfluencedBy, prov:wasQuotedFrom, prov:wasRevisionOf, prov: hadPrimarySource, prov:alternateOf, prov:specializationOf). @it

Catalogued resource
type: Class
comment: Recurso publicado o curado por un agente único. @es
comment: Resource published or curated by a single agent.
comment: Ressource udgivet eller udvalgt og arrangeret af en enkelt aktør. @da
comment: Risorsa pubblicata o curata da un singolo agente. @it
comment: Zdroj publikovaný či řízený jediným činitelem. @cs
label: Katalogiseret ressource @da
label: Katalogizovaný zdroj @cs
label: Recurso catalogado @es
label: Risorsa catalogata @it
change note: New class added in DCAT 2
change note: Nová třída přidaná ve verzi DCAT 2 @cs
change note: Nueva clase agregada en DCAT 2 @es
change note: Nuova classe aggiunta in DCAT 2 @it
change note: Ny klasse i DCAT 2 @da
editorial note: 2020-08-23 Scopenote updated and needs to be translated
scope note: Klassen for alle katalogiserede ressourcer, den overordnede klasse for dcat:Dataset, dcat:DataService, dcat:Catalog og enhvert medlem af et dcat:Catalog. Denne klasse bærer egenskaber der gælder alle katalogiserede ressourcer, herunder dataset og datatjenester. Det anbefales kraftigt at mere specifikke subklasser oprettes. Når der beskrives ressourcer der ikke er dcat:Dataset eller dcat:DataService, anbefales det at oprette passende subklasser af dcat:Resource eller at dcat:Resource anvendes sammen med egenskaben dcterms:type til opmærkning med en specifik typeangivelse. @da
scope note: La clase de todos los recursos catalogados, la superclase de dcat:Dataset, dcat:DataService, dcat:Catalog y cualquier otro miembro de un dcat:Catalog. Esta clase tiene propiedades comunes a todos los recursos catalogados, incluyendo conjuntos de datos y servicios de datos. Se recomienda fuertemente que se use una clase más específica. Cuando se describe un recurso que no es un dcat:Dataset o dcat:DataService, se recomienda crear una sub-clase apropiada de dcat:Resource, o usar dcat:Resource con la propiedad dcterms:type to indicar el tipo específico. @es
scope note: La classe di tutte le risorse catalogate, la Superclasse di dcat:Dataset, dcat:DataService, dcat:Catalog e qualsiasi altro membro di dcat:Catalog. Questa classe porta proprietà comuni a tutte le risorse catalogate, inclusi set di dati e servizi dati. Si raccomanda vivamente di utilizzare una sottoclasse più specifica. Quando si descrive una risorsa che non è un dcat:Dataset o dcat:DataService, si raccomanda di creare una sottoclasse di dcat:Resource appropriata, o utilizzare dcat:Resource con la proprietà dcterms:type per indicare il tipo specifico. @it
scope note: The class of all catalogued resources, the Superclass of dcat:Dataset, dcat:DataService, dcat:Catalog and any other member of a dcat:Catalog. This class carries properties common to all catalogued resources, including datasets and data services. The instances of this class SHOULD be included in a catalog. The instances of this class SHOULD be included in a catalog. It is strongly recommended to use a more specific sub-class. When describing a resource which is not a dcat:Dataset or dcat:DataService, it is recommended to create a suitable sub-class of dcat:Resource, or use dcat:Resource with the dcterms:type property to indicate the specific type.
scope note: Třída všech katalogizovaných zdrojů, nadtřída dcat:Dataset, dcat:DataService, dcat:Catalog a všech ostatních členů dcat:Catalog. Tato třída nese vlastnosti společné všem katalogizovaným zdrojům včetně datových sad a datových služeb. Je silně doporučeno používat specifičtější podtřídy, pokud je to možné. Při popisu zdroje, který není ani dcat:Dataset, ani dcat:DataService se doporučuje vytvořit odpovídající podtřídu dcat:Resrouce a nebo použít dcat:Resource s vlastností dcterms:type pro určení konkrétního typu. @cs
scope note: dcat:Resource er et udvidelsespunkt der tillader oprettelsen af enhver type af kataloger. Yderligere subklasser kan defineres i en DCAT-profil eller i en applikation til kataloger med andre typer af ressourcer. @da
scope note: dcat:Resource es un punto de extensión que permite la definición de cualquier tipo de catálogo. Se pueden definir subclases adicionales en perfil de DCAT o una aplicación para catálogos de otro tipo de recursos. @es
scope note: dcat:Resource is an extension point that enables the definition of any kind of catalog. Additional subclasses may be defined in a DCAT profile or application for catalogs of other kinds of resources.
scope note: dcat:Resource je bod pro rozšíření umožňující definici různých druhů katalogů. Další podtřídy lze definovat v profilech DCAT či aplikacích pro katalogy zdrojů jiných druhů. @cs
scope note: dcat:Resource è un punto di estensione che consente la definizione di qualsiasi tipo di catalogo. Sottoclassi aggiuntive possono essere definite in un profilo DCAT o in un'applicazione per cataloghi di altri tipi di risorse. @it

Rol
type: Class
subclass of: Concept
comment: A role is the function of a resource or agent with respect to another resource, in the context of resource attribution or resource relationships.
comment: En rolle er den funktion en ressource eller aktør har i forhold til en anden ressource, i forbindelse med ressourcekreditering eller ressourcerelationer. @da
comment: Role je funkce zdroje či agenta ve vztahu k jinému zdroji, v kontextu přiřazení zdrojů či vztahů mezi zdroji. @cs
comment: Un rol es la función de un recurso o agente con respecto a otro recuros, en el contexto de atribución del recurso o de las relaciones entre recursos. @es
comment: Un ruolo è la funzione di una risorsa o di un agente rispetto ad un'altra risorsa, nel contesto dell'attribuzione delle risorse o delle relazioni tra risorse. @it
label: Role
label: Rolle @da
label: Ruolo @it
change note: New class added in DCAT 2
change note: Nová třída přidaná ve verzi DCAT 2 @cs
change note: Nueva clase agregada en DCAT 2 @es
change note: Nuova classe aggiunta in DCAT 2 @it
change note: Ny klasse tilføjet i DCAT 2 @da
editorial note: Incluída en DCAT para complementar prov:Role (cuyo uso está limitado a roles en el contexto de una actividad, ya que es el rango es prov:hadRole). @es
editorial note: Introdotta in DCAT per completare prov:Role (il cui uso è limitato ai ruoli nel contesto di un'attività, in conseguenza alla definizione del codominio di prov:hadRole). @it
editorial note: Introduced into DCAT to complement prov:Role (whose use is limited to roles in the context of an activity, as the range of prov:hadRole).
editorial note: Introduceret i DCAT for at supplere prov:Role (hvis anvendelse er begrænset til roller i forbindelse med en aktivitet, som er rækkevidde for prov:hadRole). @da
editorial note: Přidáno do DCAT pro doplnění třídy prov:Role (jejíž užití je omezeno na role v kontextu aktivit, jakožto obor hodnot vlastnosti prov:hadRole). @cs
scope note: Anvendes i forbindelse med kvalificerede krediteringer til at angive aktørens rolle i forhold til en entitet. Det anbefales at værdierne styres som et kontrolleret udfaldsrum med aktørroller, såsom http://registry.it.csiro.au/def/isotc211/CI_RoleCode. @da
scope note: Anvendes i forbindelse med kvalificerede relationer til at specificere en entitets rolle i forhold til en anden entitet. Det anbefales at værdierne styres med et kontrolleret udfaldsrum for for entitetsroller såsom: ISO 19115 DS_AssociationTypeCode http://registry.it.csiro.au/def/isotc211/DS_AssociationTypeCode; IANA Registry of Link Relations https://www.iana.org/assignments/link-relation; DataCite metadata schema; MARC relators https://id.loc.gov/vocabulary/relators. @da
scope note: Použito v kvalifikovaném přiřazení pro specifikaci role Agenta ve vztahu k Entitě. Je doporučeno množinu hodnot spravovat jako řízený slovník rolí agentů, jako například http://registry.it.csiro.au/def/isotc211/CI_RoleCode. @cs
scope note: Použito v kvalifikovaném vztahu pro specifikaci role Entity ve vztahu k jiné Entitě. Je doporučeno množinu hodnot spravovat jako řízený slovník rolí entit, jako například ISO 19115 DS_AssociationTypeCode http://registry.it.csiro.au/def/isotc211/DS_AssociationTypeCode, IANA Registry of Link Relations https://www.iana.org/assignments/link-relation, DataCite metadata schema, či MARC relators https://id.loc.gov/vocabulary/relators. @cs
scope note: Se usa en una atribución cualificada para especificar el rol de un Agente con respecto a una Entidad. Se recomienda que los valores se administren como un vocabulario controlado de roles de agente, como por ejemplo http://registry.it.csiro.au/def/isotc211/CI_RoleCode. @es
scope note: Se usa en una relación cualificada para especificar el rol de una Entidad con respecto a otra Entidad. Se recomienda que los valores se administren como los valores de un vocabulario controlado de roles de entidad como por ejemplo: ISO 19115 DS_AssociationTypeCode http://registry.it.csiro.au/def/isotc211/DS_AssociationTypeCode; IANA Registry of Link Relations https://www.iana.org/assignments/link-relation; el esquema de metadatos de DataCite; MARC relators https://id.loc.gov/vocabulary/relators. @es
scope note: Used in a qualified-attribution to specify the role of an Agent with respect to an Entity. It is recommended that the values be managed as a controlled vocabulary of agent roles, such as http://registry.it.csiro.au/def/isotc211/CI_RoleCode.
scope note: Used in a qualified-relation to specify the role of an Entity with respect to another Entity. It is recommended that the values be managed as a controlled vocabulary of entity roles such as: ISO 19115 DS_AssociationTypeCode http://registry.it.csiro.au/def/isotc211/DS_AssociationTypeCode; IANA Registry of Link Relations https://www.iana.org/assignments/link-relation; DataCite metadata schema; MARC relators https://id.loc.gov/vocabulary/relators.
scope note: Utilizzato in un'attribuzione qualificata per specificare il ruolo di un agente rispetto a un'entità. Si consiglia di attribuire i valori considerando un vocabolario controllato dei ruoli dell'agente, ad esempio http://registry.it.csiro.au/def/isotc211/CI_RoleCode. @it
scope note: Utilizzato in una relazione qualificata per specificare il ruolo di un'entità rispetto a un'altra entità. Si raccomanda che il valore sia preso da un vocabolario controllato di ruoli di entità come ISO 19115 DS_AssociationTypeCode http://registry.it.csiro.au/def/isotc211/DS_AssociationTypeCode, IANA Registry of Link Relations https://www.iana.org/assignments/link-relation, DataCite metadata schema, o MARC relators https://id.loc.gov/vocabulary/relators. @it

Activity
type: Class
disjoint with: Entity
category: starting-point
component: entities-activities
constraints: http://www.w3.org/TR/2013/REC-prov-constraints-20130430/#prov-dm-constraints-fig
definition: An activity is something that occurs over a period of time and acts upon or with entities; it may include consuming, processing, transforming, modifying, relocating, using, or generating entities.
dm: http://www.w3.org/TR/2013/REC-prov-dm-20130430/#term-Activity
n: http://www.w3.org/TR/2013/REC-prov-n-20130430/#expression-Activity

ActivityInfluence
type: Class
subclass of: Influence
subclass of: Restriction
  on property: hadActivity
  max cardinality: 0
disjoint with: EntityInfluence
comment: ActivityInfluence provides additional descriptions of an Activity's binary influence upon any other kind of resource. Instances of ActivityInfluence use the prov:activity property to cite the influencing Activity.
comment: It is not recommended that the type ActivityInfluence be asserted without also asserting one of its more specific subclasses.
category: qualified
editors definition: ActivitiyInfluence is the capacity of an activity to have an effect on the character, development, or behavior of another by means of generation, invalidation, communication, or other.

Agent
type: Class
disjoint with: InstantaneousEvent
category: starting-point
component: agents-responsibility
definition: An agent is something that bears some form of responsibility for an activity taking place, for the existence of an entity, or for another agent's activity.
dm: http://www.w3.org/TR/2013/REC-prov-dm-20130430/#term-agent
n: http://www.w3.org/TR/2013/REC-prov-n-20130430/#expression-Agent

AgentInfluence
type: Class
subclass of: Influence
comment: AgentInfluence provides additional descriptions of an Agent's binary influence upon any other kind of resource. Instances of AgentInfluence use the prov:agent property to cite the influencing Agent.
comment: It is not recommended that the type AgentInfluence be asserted without also asserting one of its more specific subclasses.
category: qualified
editors definition: AgentInfluence is the capacity of an agent to have an effect on the character, development, or behavior of another by means of attribution, association, delegation, or other.

Association
type: Class
subclass of: AgentInfluence
comment: An instance of prov:Association provides additional descriptions about the binary prov:wasAssociatedWith relation from an prov:Activity to some prov:Agent that had some responsiblity for it. For example, :baking prov:wasAssociatedWith :baker; prov:qualifiedAssociation [ a prov:Association; prov:agent :baker; :foo :bar ].
category: qualified
component: agents-responsibility
definition: An activity association is an assignment of responsibility to an agent for an activity, indicating that the agent had a role in the activity. It further allows for a plan to be specified, which is the plan intended by the agent to achieve some goals in the context of this activity.
dm: http://www.w3.org/TR/2013/REC-prov-dm-20130430/#term-Association
n: http://www.w3.org/TR/2013/REC-prov-n-20130430/#expression-Association
unqualified form: wasAssociatedWith

Attribution
type: Class
subclass of: AgentInfluence
comment: An instance of prov:Attribution provides additional descriptions about the binary prov:wasAttributedTo relation from an prov:Entity to some prov:Agent that had some responsible for it. For example, :cake prov:wasAttributedTo :baker; prov:qualifiedAttribution [ a prov:Attribution; prov:entity :baker; :foo :bar ].
category: qualified
component: agents-responsibility
constraints: http://www.w3.org/TR/2013/REC-prov-constraints-20130430/#prov-dm-constraints-fig
definition: Attribution is the ascribing of an entity to an agent. When an entity e is attributed to agent ag, entity e was generated by some unspecified activity that in turn was associated to agent ag. Thus, this relation is useful when the activity is not known, or irrelevant.
dm: http://www.w3.org/TR/2013/REC-prov-dm-20130430/#term-attribution
n: http://www.w3.org/TR/2013/REC-prov-n-20130430/#expression-attribution
unqualified form: wasAttributedTo

Bundle
type: Class
subclass of: Entity
comment: Note that there are kinds of bundles (e.g. handwritten letters, audio recordings, etc.) that are not expressed in PROV-O, but can be still be described by PROV-O.
category: expanded
definition: A bundle is a named set of provenance descriptions, and is itself an Entity, so allowing provenance of provenance to be expressed.
dm: http://www.w3.org/TR/2013/REC-prov-dm-20130430/#term-bundle-entity
n: http://www.w3.org/TR/2013/REC-prov-n-20130430/#expression-bundle-declaration

Collection
type: Class
subclass of: Entity
category: expanded
component: collections
definition: A collection is an entity that provides a structure to some constituents, which are themselves entities. These constituents are said to be member of the collections.
dm: http://www.w3.org/TR/2013/REC-prov-dm-20130430/#term-collection

Communication
type: Class
subclass of: ActivityInfluence
comment: An instance of prov:Communication provides additional descriptions about the binary prov:wasInformedBy relation from an informed prov:Activity to the prov:Activity that informed it. For example, :you_jumping_off_bridge prov:wasInformedBy :everyone_else_jumping_off_bridge; prov:qualifiedCommunication [ a prov:Communication; prov:activity :everyone_else_jumping_off_bridge; :foo :bar ].
category: qualified
component: entities-activities
constraints: http://www.w3.org/TR/2013/REC-prov-constraints-20130430/#prov-dm-constraints-fig
definition: Communication is the exchange of an entity by two activities, one activity using the entity generated by the other.
dm: http://www.w3.org/TR/2013/REC-prov-dm-20130430/#term-Communication
n: http://www.w3.org/TR/2013/REC-prov-n-20130430/#expression-wasInformedBy
unqualified form: wasInformedBy

Delegation
type: Class
subclass of: AgentInfluence
comment: An instance of prov:Delegation provides additional descriptions about the binary prov:actedOnBehalfOf relation from a performing prov:Agent to some prov:Agent for whom it was performed. For example, :mixing prov:wasAssociatedWith :toddler . :toddler prov:actedOnBehalfOf :mother; prov:qualifiedDelegation [ a prov:Delegation; prov:entity :mother; :foo :bar ].
category: qualified
component: agents-responsibility
definition: Delegation is the assignment of authority and responsibility to an agent (by itself or by another agent) to carry out a specific activity as a delegate or representative, while the agent it acts on behalf of retains some responsibility for the outcome of the delegated work. For example, a student acted on behalf of his supervisor, who acted on behalf of the department chair, who acted on behalf of the university; all those agents are responsible in some way for the activity that took place but we do not say explicitly who bears responsibility and to what degree.
dm: http://www.w3.org/TR/2013/REC-prov-dm-20130430/#term-delegation
n: http://www.w3.org/TR/2013/REC-prov-n-20130430/#expression-delegation
unqualified form: actedOnBehalfOf

Derivation
type: Class
subclass of: EntityInfluence
comment: An instance of prov:Derivation provides additional descriptions about the binary prov:wasDerivedFrom relation from some derived prov:Entity to another prov:Entity from which it was derived. For example, :chewed_bubble_gum prov:wasDerivedFrom :unwrapped_bubble_gum; prov:qualifiedDerivation [ a prov:Derivation; prov:entity :unwrapped_bubble_gum; :foo :bar ].
comment: The more specific forms of prov:Derivation (i.e., prov:Revision, prov:Quotation, prov:PrimarySource) should be asserted if they apply.
category: qualified
component: derivations
constraints: http://www.w3.org/TR/2013/REC-prov-constraints-20130430/#prov-dm-constraints-fig
definition: A derivation is a transformation of an entity into another, an update of an entity resulting in a new one, or the construction of a new entity based on a pre-existing entity.
dm: http://www.w3.org/TR/2013/REC-prov-dm-20130430/#term-Derivation
n: http://www.w3.org/TR/2013/REC-prov-n-20130430/#Derivation-Relation
unqualified form: wasDerivedFrom

EmptyCollection
type: Class
subclass of: Collection
type: NamedIndividual
category: expanded
component: collections
definition: An empty collection is a collection without members.

End
type: Class
subclass of: EntityInfluence
subclass of: InstantaneousEvent
comment: An instance of prov:End provides additional descriptions about the binary prov:wasEndedBy relation from some ended prov:Activity to an prov:Entity that ended it. For example, :ball_game prov:wasEndedBy :buzzer; prov:qualifiedEnd [ a prov:End; prov:entity :buzzer; :foo :bar; prov:atTime '2012-03-09T08:05:08-05:00'^^xsd:dateTime ].
category: qualified
component: entities-activities
constraints: http://www.w3.org/TR/2013/REC-prov-constraints-20130430/#prov-dm-constraints-fig
definition: End is when an activity is deemed to have been ended by an entity, known as trigger. The activity no longer exists after its end. Any usage, generation, or invalidation involving an activity precedes the activity's end. An end may refer to a trigger entity that terminated the activity, or to an activity, known as ender that generated the trigger.
dm: http://www.w3.org/TR/2013/REC-prov-dm-20130430/#term-End
n: http://www.w3.org/TR/2013/REC-prov-n-20130430/#expression-End
unqualified form: wasEndedBy

Entity
type: Class
disjoint with: InstantaneousEvent
category: starting-point
component: entities-activities
constraints: http://www.w3.org/TR/2013/REC-prov-constraints-20130430/#prov-dm-constraints-fig
definition: An entity is a physical, digital, conceptual, or other kind of thing with some fixed aspects; entities may be real or imaginary.
dm: http://www.w3.org/TR/2013/REC-prov-dm-20130430/#term-entity
n: http://www.w3.org/TR/2013/REC-prov-n-20130430/#expression-Entity

EntityInfluence
type: Class
subclass of: Influence
comment: EntityInfluence provides additional descriptions of an Entity's binary influence upon any other kind of resource. Instances of EntityInfluence use the prov:entity property to cite the influencing Entity.
comment: It is not recommended that the type EntityInfluence be asserted without also asserting one of its more specific subclasses.
category: qualified
editors definition: EntityInfluence is the capacity of an entity to have an effect on the character, development, or behavior of another by means of usage, start, end, derivation, or other.

Generation
type: Class
subclass of: ActivityInfluence
subclass of: InstantaneousEvent
comment: An instance of prov:Generation provides additional descriptions about the binary prov:wasGeneratedBy relation from a generated prov:Entity to the prov:Activity that generated it. For example, :cake prov:wasGeneratedBy :baking; prov:qualifiedGeneration [ a prov:Generation; prov:activity :baking; :foo :bar ].
category: qualified
component: entities-activities
constraints: http://www.w3.org/TR/2013/REC-prov-constraints-20130430/#prov-dm-constraints-fig
definition: Generation is the completion of production of a new entity by an activity. This entity did not exist before generation and becomes available for usage after this generation.
dm: http://www.w3.org/TR/2013/REC-prov-dm-20130430/#term-Generation
n: http://www.w3.org/TR/2013/REC-prov-n-20130430/#expression-Generation
unqualified form: wasGeneratedBy

Influence
type: Class
comment: An instance of prov:Influence provides additional descriptions about the binary prov:wasInfluencedBy relation from some influenced Activity, Entity, or Agent to the influencing Activity, Entity, or Agent. For example, :stomach_ache prov:wasInfluencedBy :spoon; prov:qualifiedInfluence [ a prov:Influence; prov:entity :spoon; :foo :bar ] . Because prov:Influence is a broad relation, the more specific relations (Communication, Delegation, End, etc.) should be used when applicable.
comment: Because prov:Influence is a broad relation, its most specific subclasses (e.g. prov:Communication, prov:Delegation, prov:End, prov:Revision, etc.) should be used when applicable.
category: qualified
component: derivations
definition: Influence is the capacity of an entity, activity, or agent to have an effect on the character, development, or behavior of another by means of usage, start, end, generation, invalidation, communication, derivation, attribution, association, or delegation.
dm: http://www.w3.org/TR/2013/REC-prov-dm-20130430/#term-influence
n: http://www.w3.org/TR/2013/REC-prov-n-20130430/#expression-influence
unqualified form: wasInfluencedBy

InstantaneousEvent
type: Class
comment: An instantaneous event, or event for short, happens in the world and marks a change in the world, in its activities and in its entities. The term 'event' is commonly used in process algebra with a similar meaning. Events represent communications or interactions; they are assumed to be atomic and instantaneous.
category: qualified
component: entities-activities
constraints: http://www.w3.org/TR/2013/REC-prov-constraints-20130430/#dfn-event
definition: The PROV data model is implicitly based on a notion of instantaneous events (or just events), that mark transitions in the world. Events include generation, usage, or invalidation of entities, as well as starting or ending of activities. This notion of event is not first-class in the data model, but it is useful for explaining its other concepts and its semantics.

Invalidation
type: Class
subclass of: ActivityInfluence
subclass of: InstantaneousEvent
comment: An instance of prov:Invalidation provides additional descriptions about the binary prov:wasInvalidatedBy relation from an invalidated prov:Entity to the prov:Activity that invalidated it. For example, :uncracked_egg prov:wasInvalidatedBy :baking; prov:qualifiedInvalidation [ a prov:Invalidation; prov:activity :baking; :foo :bar ].
category: qualified
component: entities-activities
constraints: http://www.w3.org/TR/2013/REC-prov-constraints-20130430/#prov-dm-constraints-fig
definition: Invalidation is the start of the destruction, cessation, or expiry of an existing entity by an activity. The entity is no longer available for use (or further invalidation) after invalidation. Any generation or usage of an entity precedes its invalidation.
dm: http://www.w3.org/TR/2013/REC-prov-dm-20130430/#term-Invalidation
n: http://www.w3.org/TR/2013/REC-prov-n-20130430/#expression-Invalidation
unqualified form: wasInvalidatedBy

Location
type: Class
category: expanded
definition: A location can be an identifiable geographic place (ISO 19112), but it can also be a non-geographic place such as a directory, row, or column. As such, there are numerous ways in which location can be expressed, such as by a coordinate, address, landmark, and so forth.
dm: http://www.w3.org/TR/2013/REC-prov-dm-20130430/#term-attribute-location
n: http://www.w3.org/TR/2013/REC-prov-n-20130430/#expression-attribute

Organization
type: Class
subclass of: Agent
category: expanded
component: agents-responsibility
definition: An organization is a social or legal institution such as a company, society, etc.
dm: http://www.w3.org/TR/2013/REC-prov-dm-20130430/#term-agent
n: http://www.w3.org/TR/2013/REC-prov-n-20130430/#expression-types

Person
type: Class
subclass of: Agent
category: expanded
component: agents-responsibility
definition: Person agents are people.
dm: http://www.w3.org/TR/2013/REC-prov-dm-20130430/#term-agent
n: http://www.w3.org/TR/2013/REC-prov-n-20130430/#expression-types

Plan
type: Class
subclass of: Entity
comment: There exist no prescriptive requirement on the nature of plans, their representation, the actions or steps they consist of, or their intended goals. Since plans may evolve over time, it may become necessary to track their provenance, so plans themselves are entities. Representing the plan explicitly in the provenance can be useful for various tasks: for example, to validate the execution as represented in the provenance record, to manage expectation failures, or to provide explanations.
category: expanded
category: qualified
component: agents-responsibility
definition: A plan is an entity that represents a set of actions or steps intended by one or more agents to achieve some goals.
dm: http://www.w3.org/TR/2013/REC-prov-dm-20130430/#term-Association
n: http://www.w3.org/TR/2013/REC-prov-n-20130430/#expression-Association

PrimarySource
type: Class
subclass of: Derivation
comment: An instance of prov:PrimarySource provides additional descriptions about the binary prov:hadPrimarySource relation from some secondary prov:Entity to an earlier, primary prov:Entity. For example, :blog prov:hadPrimarySource :newsArticle; prov:qualifiedPrimarySource [ a prov:PrimarySource; prov:entity :newsArticle; :foo :bar ] .
category: qualified
component: derivations
definition: A primary source for a topic refers to something produced by some agent with direct experience and knowledge about the topic, at the time of the topic's study, without benefit from hindsight. Because of the directness of primary sources, they 'speak for themselves' in ways that cannot be captured through the filter of secondary sources. As such, it is important for secondary sources to reference those primary sources from which they were derived, so that their reliability can be investigated. A primary source relation is a particular case of derivation of secondary materials from their primary sources. It is recognized that the determination of primary sources can be up to interpretation, and should be done according to conventions accepted within the application's domain.
dm: http://www.w3.org/TR/2013/REC-prov-dm-20130430/#term-primary-source
n: http://www.w3.org/TR/2013/REC-prov-n-20130430/#expression-original-source
unqualified form: hadPrimarySource

Quotation
type: Class
subclass of: Derivation
comment: An instance of prov:Quotation provides additional descriptions about the binary prov:wasQuotedFrom relation from some taken prov:Entity from an earlier, larger prov:Entity. For example, :here_is_looking_at_you_kid prov:wasQuotedFrom :casablanca_script; prov:qualifiedQuotation [ a prov:Quotation; prov:entity :casablanca_script; :foo :bar ].
category: qualified
component: derivations
definition: A quotation is the repeat of (some or all of) an entity, such as text or image, by someone who may or may not be its original author. Quotation is a particular case of derivation.
dm: http://www.w3.org/TR/2013/REC-prov-dm-20130430/#term-quotation
n: http://www.w3.org/TR/2013/REC-prov-n-20130430/#expression-quotation
unqualified form: wasQuotedFrom

Revision
type: Class
subclass of: Derivation
comment: An instance of prov:Revision provides additional descriptions about the binary prov:wasRevisionOf relation from some newer prov:Entity to an earlier prov:Entity. For example, :draft_2 prov:wasRevisionOf :draft_1; prov:qualifiedRevision [ a prov:Revision; prov:entity :draft_1; :foo :bar ].
category: qualified
component: derivations
definition: A revision is a derivation for which the resulting entity is a revised version of some original. The implication here is that the resulting entity contains substantial content from the original. Revision is a particular case of derivation.
dm: http://www.w3.org/TR/2013/REC-prov-dm-20130430/#term-revision
n: http://www.w3.org/TR/2013/REC-prov-n-20130430/#expression-Revision
unqualified form: wasRevisionOf

Role
type: Class
category: qualified
component: agents-responsibility
definition: A role is the function of an entity or agent with respect to an activity, in the context of a usage, generation, invalidation, association, start, and end.
dm: http://www.w3.org/TR/2013/REC-prov-dm-20130430/#term-attribute-role
n: http://www.w3.org/TR/2013/REC-prov-n-20130430/#expression-attribute

SoftwareAgent
type: Class
subclass of: Agent
category: expanded
component: agents-responsibility
definition: A software agent is running software.
dm: http://www.w3.org/TR/2013/REC-prov-dm-20130430/#term-agent
n: http://www.w3.org/TR/2013/REC-prov-n-20130430/#expression-types

Start
type: Class
subclass of: EntityInfluence
subclass of: InstantaneousEvent
comment: An instance of prov:Start provides additional descriptions about the binary prov:wasStartedBy relation from some started prov:Activity to an prov:Entity that started it. For example, :foot_race prov:wasStartedBy :bang; prov:qualifiedStart [ a prov:Start; prov:entity :bang; :foo :bar; prov:atTime '2012-03-09T08:05:08-05:00'^^xsd:dateTime ] .
category: qualified
component: entities-activities
constraints: http://www.w3.org/TR/2013/REC-prov-constraints-20130430/#prov-dm-constraints-fig
definition: Start is when an activity is deemed to have been started by an entity, known as trigger. The activity did not exist before its start. Any usage, generation, or invalidation involving an activity follows the activity's start. A start may refer to a trigger entity that set off the activity, or to an activity, known as starter, that generated the trigger.
dm: http://www.w3.org/TR/2013/REC-prov-dm-20130430/#term-Start
n: http://www.w3.org/TR/2013/REC-prov-n-20130430/#expression-Start
unqualified form: wasStartedBy

Usage
type: Class
subclass of: EntityInfluence
subclass of: InstantaneousEvent
comment: An instance of prov:Usage provides additional descriptions about the binary prov:used relation from some prov:Activity to an prov:Entity that it used. For example, :keynote prov:used :podium; prov:qualifiedUsage [ a prov:Usage; prov:entity :podium; :foo :bar ].
category: qualified
component: entities-activities
constraints: http://www.w3.org/TR/2013/REC-prov-constraints-20130430/#prov-dm-constraints-fig
definition: Usage is the beginning of utilizing an entity by an activity. Before usage, the activity had not begun to utilize this entity and could not have been affected by the entity.
dm: http://www.w3.org/TR/2013/REC-prov-dm-20130430/#term-Usage
n: http://www.w3.org/TR/2013/REC-prov-n-20130430/#expression-Usage
unqualified form: used

DCMI Metadata Terms - other
type: NamedIndividual
Date Modified: 2012-06-14
publisher: DCMI

DCMI Type Vocabulary
type: NamedIndividual
type: VocabularyEncodingScheme
issued: 2000-07-11
comment: The set of classes specified by the DCMI Type Vocabulary, used to categorize the nature or genre of the resource.

DDC
type: NamedIndividual
type: VocabularyEncodingScheme
issued: 2000-07-11
comment: The set of conceptual resources specified by the Dewey Decimal Classification.

IMT
type: NamedIndividual
type: VocabularyEncodingScheme
issued: 2000-07-11
comment: The set of media types specified by the Internet Assigned Numbers Authority.

LCC
type: NamedIndividual
type: VocabularyEncodingScheme
issued: 2000-07-11
comment: The set of conceptual resources specified by the Library of Congress Classification.

LCSH
type: NamedIndividual
type: VocabularyEncodingScheme
issued: 2000-07-11
comment: The set of labeled concepts specified by the Library of Congress Subject Headings.

MeSH
type: NamedIndividual
type: VocabularyEncodingScheme
issued: 2000-07-11
comment: The set of labeled concepts specified by the Medical Subject Headings.

NLM
type: NamedIndividual
type: VocabularyEncodingScheme
issued: 2005-06-13
comment: The set of conceptual resources specified by the National Library of Medicine Classification.

TGN
type: NamedIndividual
type: VocabularyEncodingScheme
issued: 2000-07-11
comment: The set of places specified by the Getty Thesaurus of Geographic Names.

UDC
type: NamedIndividual
type: VocabularyEncodingScheme
issued: 2000-07-11
comment: The set of conceptual resources specified by the Universal Decimal Classification.

Instructional Method
type: NamedIndividual
issued: 2005-06-13
range includes: Method of Instruction
description: Instructional Method typically includes ways of presenting instructional materials or conducting instructional activities, patterns of learner-to-learner and learner-to-instructor interactions, and mechanisms by which group and individual levels of learning are measured. Instructional methods include all aspects of the instruction and learning processes from planning and implementation through evaluation and feedback.
comment: A process, used to engender knowledge, attitudes and skills, that the described resource is designed to support.

Provenance
type: NamedIndividual
issued: 2004-09-20
range includes: Provenance Statement
description: The statement may include a description of any changes successive custodians made to the resource.
comment: A statement of any changes in ownership and custody of the resource since its creation that are significant for its authenticity, integrity, and interpretation.

Rights Holder
type: NamedIndividual
issued: 2004-06-14
range includes: Agent
description: Recommended practice is to refer to the rights holder with a URI. If this is not possible or feasible, a literal value that identifies the rights holder may be provided.
comment: A person or organization owning or managing rights over the resource.

HTTP_GET
type: NamedIndividual
type: EndpointType
comment: HTTP GET endpoint type
preferred label: http get

HTTP_POST
type: NamedIndividual
type: EndpointType
comment: HTTP POST endpoint type
preferred label: http post

dcat
type: NamedIndividual
has current version: dcat3
has version: dcat2
has version: dcat2014
has version: dcat3
previous version: dcat2
Date Created: 2020-12-17
Date Modified: 2020-11-30
Date Modified: 2021-03-09
Date Modified: 2021-04-08
Date Modified: 2021-06-23
Date Modified: 2021-09-27
Date Modified: 2022-03-22
Date Modified: 2022-05-23
Date Modified: 2023-01-05
version: 3